program: Orca
programVersion: 5.0.4
elementType: S S H N N O O C C C C C C C C C C N N C N C C N C C H H H H H H H H H H H H H
keywords: PBE0 aug-cc-pVDZ AutoAux D4 VeryTightSCF
charge: 0
multiplicity: 1
formula: C15H14N6O2S2
InChI: InChI=1/C15H14N6O2S2/c16-10-8(12(22)20-14(24)18-10)7(6-4-2-1-3-5-6)9-11(17)19-15(25)21-13(9)23/h1-5,7,18-21H,16-17H2
39 atoms
S  4.185946 -4.096493 -2.081001
S  -5.734949 -1.511659 -1.408619
H  1.182486 3.89562 2.496629
N  1.063969 -0.303521 -1.915497
N  -1.953862 -3.218785 1.235871
O  0.962523 -3.531929 1.564221
O  -1.422235 0.787297 -1.269226
C  -0.142775 -1.03197 0.716813
C  1.887611 2.093419 1.56318
C  1.549172 0.834394 1.082482
C  0.920113 2.911965 2.123845
C  0.239058 0.376697 1.147142
C  -0.389744 2.455801 2.207654
C  -0.723863 1.201008 1.726376
C  -1.519245 -1.142795 0.102942
C  -2.032572 -0.188993 -0.801256
C  -2.325746 -2.218713 0.438935
N  -3.354447 -0.35838 -1.205926
N  -3.602971 -2.29229 -0.050695
C  -4.167115 -1.373568 -0.866265
N  2.442427 -2.125647 -1.834017
C  2.961254 -3.263144 -1.320902
C  1.443903 -1.386945 -1.251351
N  2.402938 -3.661039 -0.16321
C  0.920557 -1.79032 -0.033989
C  1.38687 -3.001735 0.522151
H  2.829076 -1.812473 -2.715666
H  -4.17872 -3.085155 0.201631
H  1.454842 -0.10687 -2.823211
H  0.237208 0.220011 -1.618341
H  -0.974922 -3.343847 1.482897
H  -2.582403 -3.991289 1.395035
H  2.741439 -4.52055 0.249596
H  -3.721377 0.339356 -1.840063
H  -0.21048 -1.563982 1.671222
H  2.91591 2.431398 1.496913
H  2.32189 0.204123 0.657967
H  -1.156382 3.081994 2.650605
H  -1.750414 0.856979 1.797488
elementType: S H N O C
totalener: -1854.22049622 hartree
nucrepener: 2508.75836463 hartree
electener: -4362.97886085 hartree
oneelecener: -7527.37469610 hartree
twoeener: 3164.39583524 hartree
cpcmener: -0.07196637 hartree
kineticenergy: 1847.42254175 hartree
exchangeener: -141.475246967135 hartree
correlationener: -6.795216813907 hartree
xcener: -148.270463781041 hartree
chargesum: -0.0000000
charge: -0.313727 -0.310059 -0.619530 -0.131930 -0.217973 -0.956056 -1.034516 1.068005 -0.378669 1.218349 0.549015 1.512238 -0.413420 1.073141 1.390450 0.413514 0.529597 -0.446288 -0.510632 0.472858 -0.332155 0.450223 -0.406198 -0.497426 0.902932 0.857108 -0.008427 0.029187 -0.067202 0.058253 -0.017665 -0.025088 0.024063 0.005832 -0.527341 -0.729385 -0.920727 -0.719543 -0.970808
charge: 0.474693 0.475446 0.011798 0.379112 0.377498 0.056272 0.077804 -0.085024 0.003104 0.044180 -0.007717 -0.143275 0.001686 0.040468 -0.044683 -0.337647 -0.172876 0.157240 0.168932 -0.715370 0.169053 -0.715368 -0.187174 0.156330 -0.053096 -0.339604 0.054965 0.055584 0.035843 -0.096804 -0.076965 0.035668 0.047012 0.046646 0.038218 0.014342 0.013993 0.014380 0.025337
qa: -0.3137 -0.3101 -0.6195 -0.1319 -0.2180 -0.9561 -1.0345 1.0680 -0.3787 1.2183 0.5490 1.5122 -0.4134 1.0731 1.3905 0.4135 0.5296 -0.4463 -0.5106 0.4729 -0.3322 0.4502 -0.4062 -0.4974 0.9029 0.8571 -0.0084 0.0292 -0.0672 0.0583 -0.0177 -0.0251 0.0241 0.0058 -0.5273 -0.7294 -0.9207 -0.7195 -0.9708
va: 1.6875 1.6939 0.4289 2.9897 3.0311 1.2337 1.3632 0.2147 3.0253 -2.2279 3.2005 4.4658 3.4303 -3.3675 1.1002 1.8394 -2.4436 2.7886 2.7846 3.0389 2.6592 3.0711 0.8204 2.8608 2.7741 -0.8674 0.8408 0.8246 0.8525 0.8048 0.9358 0.8303 0.8591 0.8579 0.6276 0.4189 -0.3296 0.4080 -0.2353
energy: 33256.0 33284.2 34394.1 36580.1 37255.1 38573.4 39046.0 39734.6 40335.2 40739.1 40907.5 41107.8 41528.4 41689.8 42010.3 42086.7 42511.1 42708.1 43163.7 43394.7 43585.9 43729.9 44196.6 44415.1 44855.7 44907.0 44978.1 45102.9 45506.6 45559.6 45646.6 45931.3 46245.9 46324.6 46535.5 46624.9 46709.4 46856.7 47043.6 47329.2 47626.6 47759.5 47896.6 48049.1 48195.5 48393.6 48855.1 48943.6 49003.3 49058.9 49125.9 49215.8 49362.7 49529.3 49864.0 49988.6 50077.0 50267.4 50342.5 50449.3 50535.1 50672.1 50859.7 50975.0 51041.5 51162.8 51269.0 51297.2 51445.9 51480.3 51561.1 51719.5 51792.1 51918.2 51959.0 52009.6 52051.3 52490.2 52539.8 52662.7 52923.4 52968.3 52997.5 53519.6 53673.1 53725.3 54028.5 54175.7 54300.5 54387.5 54466.9 54558.7 54665.4 54741.2 54767.7 54805.3 54960.0 55024.3 55051.3 55121.0 55208.6 55291.3 55351.5 55373.6 55430.7 55503.2 55528.7 55714.0 55793.0 55894.9 55915.0 55947.0 56129.0 56220.4 56417.8 56445.2 56502.9 56634.2 56719.8 56855.9 56908.3 56941.5 57087.0 57266.5 57328.7 57444.8 57578.9 57682.1 57838.9 57915.7 58023.1 58116.8 58159.0 58232.6 58313.9 58462.3 58563.7 58630.9 58733.6 58851.0 58940.0 59043.2 59141.7 59172.0 59224.8 59279.3 59340.5 59424.9 59464.0 59521.5 59572.1 59610.7 59678.6 59821.2 59852.1 59939.8 59961.9 60062.4 60073.3 60165.0 60235.0 60336.0 60432.1 60471.4 60512.1 60562.7 60610.8 60652.4 60674.1 60688.1 60755.0 60824.6 60920.7 60986.1 61068.9 61122.0 61181.1 61228.2 61350.7 61372.6 61431.6 61543.7 61693.6 61771.8 61832.4 61959.6 62047.7 62095.8 62110.1 62229.2 62269.1 62274.4 62329.0 62465.2 62497.2 62528.4 62681.5 62792.0 62888.6 62972.4
energy: -1854.126277893425
dipole: 2.68941 -2.91168 -0.22226 9.43692 -9.51835 -0.08143 7.28295 -7.11431 0.16864
magnitude: 0.29064 au
magnitude: 0.73874 debye
