program: Orca
programVersion: 5.0.4
elementType: S S H N N O O C C C C C C C C C C N N C N C C N C C H H H H H H H H H H H H H
keywords: PBE0 ma-def2-TZVP AutoAux D4 VeryTightSCF TightOPT
charge: 0
multiplicity: 1
formula: C15H14N6O2S2
InChI: InChI=1/C15H14N6O2S2/c16-10-8(12(22)20-14(24)18-10)7(6-4-2-1-3-5-6)9-11(17)19-15(25)21-13(9)23/h1-5,7,18-21H,16-17H2
39 atoms
S  4.215055 -4.071363 -2.108057
S  -5.76956 -1.509504 -1.32619
H  1.163408 3.891195 2.496575
N  1.13888 -0.234558 -1.878754
N  -1.966369 -3.18533 1.319482
O  0.885574 -3.602396 1.456405
O  -1.407957 0.704625 -1.357389
C  -0.136234 -1.0404 0.698926
C  1.88761 2.068798 1.616661
C  1.554389 0.810988 1.130509
C  0.905445 2.907341 2.120293
C  0.235835 0.371058 1.13287
C  -0.412677 2.469722 2.143133
C  -0.741125 1.214964 1.656186
C  -1.519294 -1.160925 0.103104
C  -2.024423 -0.232682 -0.839875
C  -2.337855 -2.208424 0.490066
N  -3.360081 -0.397689 -1.213022
N  -3.625819 -2.274383 0.026065
C  -4.186038 -1.379288 -0.816578
N  2.487571 -2.087053 -1.834796
C  2.977539 -3.248162 -1.349436
C  1.48427 -1.353901 -1.251978
N  2.382058 -3.68005 -0.224673
C  0.92838 -1.78818 -0.061065
C  1.350769 -3.036662 0.45951
H  2.899324 -1.7499 -2.696104
H  -4.210007 -3.048512 0.314824
H  1.535108 -0.025295 -2.781923
H  0.269905 0.244052 -1.617845
H  -0.975275 -3.347891 1.501128
H  -2.600975 -3.947619 1.504545
H  2.698083 -4.560331 0.161131
H  -3.727175 0.279045 -1.869362
H  -0.188247 -1.578029 1.651583
H  2.923343 2.390889 1.599451
H  2.338219 0.165317 0.752577
H  -1.191629 3.11063 2.542306
H  -1.775053 0.887871 1.682077
totalener: -1854.38626797 hartree
nucrepener: 2505.49820898 hartree
electener: -4359.88447696 hartree
oneelecener: -7521.56052033 hartree
twoeener: 3161.67604337 hartree
cpcmener: -0.06051385 hartree
kineticenergy: 1848.14544778 hartree
exchangeener: -141.429746671406 hartree
correlationener: -6.772771370313 hartree
xcener: -148.202518041718 hartree
elementType: S H N O C
chargesum: -0.0000000
charge: -0.569584 -0.567953 0.174110 -0.489313 -0.587821 -0.596180 -0.519489 -0.736287 -0.101148 -0.128624 -0.046857 -0.286344 -0.205015 -0.095316 0.930194 0.306535 0.209590 -0.182609 -0.165231 0.185052 -0.171876 0.166896 0.283741 -0.213041 -0.292595 0.233796 0.322991 0.321510 0.324689 0.318855 0.313024 0.328353 0.316528 0.318407 0.159790 0.173889 0.198351 0.173951 0.195030
charge: 0.134369 0.135066 0.185421 0.016682 0.007283 -0.065733 -0.043706 -0.152494 -0.174132 -0.139528 -0.183032 -0.154976 -0.174451 -0.128826 -0.133843 -0.384083 -0.257924 0.126869 0.130718 -0.614322 0.129153 -0.613820 -0.268676 0.126049 -0.138286 -0.382278 0.268502 0.268051 0.230998 0.228916 0.223417 0.230418 0.265997 0.266533 0.244783 0.187400 0.208280 0.187543 0.207660
qa: -0.5696 -0.5680 0.1741 -0.4893 -0.5878 -0.5962 -0.5195 -0.7363 -0.1011 -0.1286 -0.0469 -0.2863 -0.2050 -0.0953 0.9302 0.3065 0.2096 -0.1826 -0.1652 0.1851 -0.1719 0.1669 0.2837 -0.2130 -0.2926 0.2338 0.3230 0.3215 0.3247 0.3189 0.3130 0.3284 0.3165 0.3184 0.1598 0.1739 0.1984 0.1740 0.1950
va: 1.6424 1.6457 0.9534 2.9194 3.0936 1.8094 1.7863 3.3629 4.0118 3.8864 3.7868 5.1052 4.2345 3.8903 0.4154 4.2365 4.1643 3.2130 3.1986 4.0182 3.2114 4.0688 4.1275 3.2330 3.7204 4.0881 0.9041 0.9039 0.9095 0.9540 0.9434 0.9087 0.9085 0.9061 0.9564 0.9526 0.9367 0.9527 0.9303
energy: -1854.541534270928
dipole: 2.76490 -2.89439 -0.12949 9.57012 -9.47789 0.09223 7.44177 -7.09517 0.34659
magnitude: 0.38131 au
magnitude: 0.96922 debye
