program: Gaussian 09
title: 000050413
version: EM64L-G09RevD.01
frameworkgroup: C1[X(C11H15ClN2O2)]
method: RPBEPBE
basis: SDD
operation: Freq
keyword: #p
keyword: freq=noraman
keyword: PBEPBE/SDD
title: #p freq=noraman PBEPBE/SDD
converged: YES YES NO NO
title: Mulliken charges:
elementType: Cl O O N N C C C C C C C C C C C H H H H H H H H H H H H H H H
charge: -0.060930 -0.313038 -0.256901 -0.313473 -0.397888 -0.203596 0.490064 -0.686653 -0.367931 -0.457845 -0.218095 -0.203278 -0.108722 0.332788 -0.217719 -0.673773 0.202469 0.225056 0.222079 0.249225 0.287038 0.292538 0.239013 0.256087 0.254442 0.308312 0.226351 0.226851 0.211675 0.228442 0.227409
chargesum: 0.00000
title: Mulliken charges with hydrogens summed into heavy atoms:
elementType: Cl O O N N C C C C C C C C C C C
charge: -0.060930 -0.313038 -0.256901 -0.026435 -0.089576 -0.001127 0.490064 0.009708 -0.075392 -0.218832 0.037993 0.051164 -0.108722 0.332788 0.235484 -0.006247
polarizability: 2.30456779e+02 7.52782620e+00 1.35749174e+02 6.59526961e+00 -6.95368204e+00 8.91923834e+01
1716.lowfreq: -12.8447 -3.5785 0.0008 0.0012 0.0021 5.6658 17.6790 28.4166 43.6478
frequency: 17.4017 28.3911 43.6313 63.4526 64.6161 83.0732 118.4686 126.3899 173.3222 183.0540 216.3929 232.7456 252.3701 284.2697 292.1857 340.8736 346.8996 369.8160 408.3806 413.3115 453.2193 511.8289 537.0062 599.4180 612.4839 631.4277 661.1593 696.6594 714.1129 723.3880 781.8733 801.8023 828.1935 843.3653 854.9284 892.5232 951.3631 955.0005 982.0270 999.8156 1021.0539 1036.1302 1069.7386 1073.3650 1106.5647 1111.8550 1116.0609 1139.6871 1142.3779 1180.2663 1208.6077 1242.0957 1249.9407 1284.4008 1312.3819 1314.9324 1358.6017 1380.1321 1385.8071 1398.1448 1400.0761 1436.7949 1461.9500 1463.7298 1474.4265 1477.2820 1478.1165 1490.7220 1511.3539 1587.3904 1600.1810 1690.8614 2867.1959 2993.2581 2994.6951 3006.4631 3063.7979 3091.2390 3091.7268 3104.8732 3105.3957 3126.4421 3148.2954 3169.2971 3172.4612 3434.8895 3457.1042
redmass: 5.5342 4.3709 2.9157 4.4964 3.6413 4.8299 3.3191 4.9968 3.1974 5.3972 2.7764 1.4512 1.1732 3.6422 5.3485 5.1167 4.2359 4.3034 4.0952 3.3834 1.5790 4.2466 2.9686 1.8971 1.7473 4.2186 4.8346 7.1676 5.1914 3.5656 3.4741 1.0967 1.3867 1.3494 3.4474 2.5624 1.7667 2.7993 1.3513 4.3555 1.6183 2.5887 2.7578 1.9153 2.4780 1.5566 2.5477 1.4654 4.1163 1.1140 2.0616 2.8346 1.1310 1.4311 1.2935 1.6382 1.3208 3.5636 1.4230 2.2500 1.2773 1.2897 1.1225 1.0407 1.2458 1.4208 1.1783 1.0819 1.4713 7.3157 6.2380 9.7074 1.0824 1.0350 1.0357 1.0581 1.1069 1.0998 1.0985 1.1010 1.1025 1.0898 1.0892 1.0952 1.0965 1.0762 1.0764
irintensity: 0.8358 0.3018 0.2291 2.3821 0.9536 2.0647 4.9086 2.0778 6.6638 0.3980 0.4765 2.5620 0.5780 3.5729 0.2440 8.1377 0.8174 1.4246 14.8088 2.2155 59.7244 15.8212 40.5834 66.9388 58.4835 5.1804 15.8682 14.1417 27.2493 5.2982 5.5770 3.4867 36.9188 28.7919 1.4906 3.6031 27.2429 50.4130 0.7168 52.3120 11.4292 90.1634 59.6851 7.6416 83.2357 5.2283 8.0353 4.7498 524.6633 0.0482 3.5971 35.1230 0.0390 4.7243 7.7332 6.1617 2.0819 2.2615 18.1046 8.9493 26.4746 28.1046 3.1281 11.7423 23.2173 97.4475 12.2614 12.5799 83.8922 2.7741 10.7702 234.7282 76.4170 18.7775 23.6279 25.5823 10.4265 42.2088 29.8557 16.3708 48.6188 11.3195 0.5560 5.8371 1.1431 28.3954 1.5949
temp: 298.150 k
press: 1.00000 atm
elementType: 17 8 8 7 7 6 6 6 6 6 6 6 6 6 6 6 1 1 1 1 1 1 1 1 1 1 1 1 1 1 1
symmnumber: 1
zpe: 646718.0 jmol-1
zpe.correction: 0.246322 hartree
zpe.thermalcorrener: 0.263411 hartree
zpe.thermalcorrenthalpy: 0.264355 hartree
zpe.thermalcorrgfe: 0.198751 hartree
zpe.sumelectzpe: -1146.947202 hartree
zpe.sumelectthermal: -1146.930112 hartree
zpe.sumelectthermalent: -1146.929168 hartree
zpe.sumelectthermalfe: -1146.994773 hartree
dipole: 2.7151 3.3112 -1.1245
dipole: 4.4272
quadrupole: -101.1740 -97.9061 -101.1539
quadrupole: -1.4011 -0.1204 -0.7226
quadrupole: -1.0960 2.1719 -1.0759 -1.4011 -0.1204 -0.7226
hfenergy: -1147.1935235 hartree
pointgroup: C01 [X(C11H15Cl1N2O2)]
dipole: -1.0167474 1.3119606 0.5280848 debye
polarizability: 229.668566|-11.7470288|135.4045464|6.4919678|9.7345067|90.3252241 unknown
InChI: InChI=1S/C11H15ClN2O2/c1-3-16-11(15)14-13-8(2)9-4-6-10(12)7-5-9/h4-8,13-14H,3H2,1-2H3
charge 0 multiplicity 1
31 atoms
Cl 6.027277 -1.112746 0.018591
O  -4.160381 0.205601 0.356016
O  -2.652614 -1.418402 -0.460723
N  -0.596815 0.184154 0.777497
N  -1.966449 0.464651 0.813836
C  0.270731 1.10595 -0.008244
C  1.695149 0.555255 0.040164
C  -0.248347 1.21044 -1.461342
C  1.933535 -0.823411 -0.197885
C  2.796793 1.411407 0.279058
C  3.247799 -1.338768 -0.204062
C  4.120519 0.914224 0.270705
C  4.322464 -0.457175 0.027335
C  -2.880305 -0.362959 0.169606
C  -5.282617 -0.561466 -0.25167
C  -6.559886 0.216846 0.050064
H  0.279017 2.134699 0.430578
H  0.423673 1.851384 -2.05804
H  -1.262652 1.646396 -1.488226
H  -0.288849 0.208656 -1.921387
H  -0.216241 -0.079622 1.694201
H  1.079804 -1.488046 -0.368175
H  2.62802 2.47785 0.472265
H  3.432995 -2.401272 -0.387001
H  4.97173 1.576229 0.45356
H  -2.336221 1.314494 1.257809
H  -5.096242 -0.660102 -1.33666
H  -5.294834 -1.57579 0.187266
H  -7.429963 -0.312371 -0.379605
H  -6.71491 0.313521 1.13837
H  -6.517981 1.228874 -0.388003
