program: Orca
programVersion: 5.0.4
elementType: S S H N N O O C C C C C C C C C C N N C N C C N C C H H H H H H H H H H H H H
keywords: PBE0 ma-def2-TZVP AutoAux D4 VeryTightSCF TightOPT
charge: 0
multiplicity: 1
formula: C15H14N6O2S2
InChI: InChI=1/C15H14N6O2S2/c16-10-8(12(22)20-14(24)18-10)7(6-4-2-1-3-5-6)9-11(17)19-15(25)21-13(9)23/h1-5,7,18-21H,16-17H2
39 atoms
S  4.190352 -4.096308 -2.094864
S  -5.743901 -1.509086 -1.388443
H  1.171203 3.897582 2.495288
N  1.092293 -0.281415 -1.904538
N  -1.961845 -3.210773 1.261968
O  0.945394 -3.55069 1.534072
O  -1.416037 0.764929 -1.287177
C  -0.139082 -1.03533 0.7120
C  1.884564 2.090668 1.576178
C  1.549688 0.83116 1.0945
C  0.911642 2.912891 2.122046
C  0.238032 0.375135 1.143692
C  -0.399623 2.458868 2.191053
C  -0.729985 1.203103 1.709093
C  -1.517789 -1.150591 0.103548
C  -2.029061 -0.203577 -0.810196
C  -2.330624 -2.217647 0.454838
N  -3.352232 -0.371211 -1.210198
N  -3.610437 -2.286161 -0.028506
C  -4.171815 -1.374794 -0.8542
N  2.455899 -2.117202 -1.836809
C  2.964804 -3.26343 -1.333327
C  1.458249 -1.377942 -1.253778
N  2.395534 -3.669355 -0.184183
C  0.924902 -1.789855 -0.042817
C  1.379515 -3.011798 0.502081
H  2.850766 -1.797295 -2.712628
H  -4.190948 -3.07234 0.234541
H  1.483925 -0.077681 -2.810837
H  0.255045 0.232966 -1.618959
H  -0.980856 -3.349578 1.496083
H  -2.593693 -3.978116 1.434724
H  2.725288 -4.535597 0.222637
H  -3.716307 0.323383 -1.850108
H  -0.201036 -1.569206 1.666049
H  2.914808 2.42628 1.522199
H  2.327688 0.198661 0.683092
H  -1.171102 3.087434 2.623151
H  -1.758249 0.861886 1.771095
totalener: -1854.38676256 hartree
nucrepener: 2505.49820898 hartree
electener: -4359.88497155 hartree
oneelecener: -7521.63865603 hartree
twoeener: 3161.75368449 hartree
cpcmener: -0.06908522 hartree
kineticenergy: 1848.14811131 hartree
exchangeener: -141.434580110674 hartree
correlationener: -6.772785856613 hartree
xcener: -148.207365967287 hartree
elementType: S H N O C
chargesum: 0.0000000
charge: -0.560588 -0.558702 0.174038 -0.502616 -0.594760 -0.667184 -0.594388 -0.508196 -0.135295 -0.023228 -0.028073 -0.531657 -0.212981 -0.023854 0.883107 0.355942 0.175171 -0.193233 -0.151113 0.189102 -0.162615 0.170734 0.316008 -0.222622 -0.343872 0.246228 0.323157 0.321677 0.326516 0.330094 0.323242 0.329998 0.319342 0.321650 0.170710 0.173735 0.197716 0.174262 0.192548
charge: 0.144239 0.144926 0.185611 0.024879 0.017856 -0.105493 -0.083947 -0.152025 -0.172306 -0.139274 -0.181478 -0.157133 -0.173161 -0.131187 -0.132027 -0.381182 -0.253434 0.129681 0.133097 -0.613781 0.131107 -0.613278 -0.265277 0.128215 -0.136783 -0.379037 0.269004 0.268636 0.232379 0.229933 0.226225 0.231861 0.267584 0.268268 0.245396 0.187597 0.208592 0.187777 0.207941
qa: -0.5606 -0.5587 0.1740 -0.5026 -0.5948 -0.6672 -0.5944 -0.5082 -0.1353 -0.0232 -0.0281 -0.5317 -0.2130 -0.0239 0.8831 0.3559 0.1752 -0.1932 -0.1511 0.1891 -0.1626 0.1707 0.3160 -0.2226 -0.3439 0.2462 0.3232 0.3217 0.3265 0.3301 0.3232 0.3300 0.3193 0.3216 0.1707 0.1737 0.1977 0.1743 0.1925
va: 1.6547 1.6588 0.9533 2.9565 3.1302 1.7214 1.6989 3.3995 4.0498 3.7549 3.7540 5.1093 4.2426 3.6836 1.0048 4.1465 4.2527 3.2578 3.1866 4.0139 3.2079 4.0666 4.0663 3.2734 3.8011 4.0840 0.9042 0.9039 0.9089 0.9300 0.9227 0.9073 0.9069 0.9041 0.9486 0.9528 0.9375 0.9518 0.9325
energy: -1854.542279904209
dipole: 2.70384 -2.91687 -0.21303 9.49556 -9.56319 -0.06763 7.35334 -7.17576 0.17758
magnitude: 0.28546 au
magnitude: 0.72558 debye
