program: Orca
programVersion: 5.0.4
elementType: S S H N N O O C C C C C C C C C C N N C N C C N C C H H H H H H H H H H H H H H H
keywords: PBE0 aug-cc-pVDZ AutoAux D4 VeryTightSCF
charge: 2
multiplicity: 1
formula: C15H16N6O2S2
InChI: InChI=1/C15H16N6O2S2/c16-10-8(12(22)20-14(24)18-10)7(6-4-2-1-3-5-6)9-11(17)19-15(25)21-13(9)23/h1-5,7,18-21H,16-17H3
41 atoms
S  3.620811 -1.756533 -4.165112
S  -5.601281 0.478769 -1.348158
H  1.699152 0.526496 5.084552
N  0.341394 -3.871884 -1.048939
N  -1.049471 1.477794 0.428565
O  1.180058 0.832129 -0.820525
O  -2.20345 -2.99819 -0.806636
C  -0.208547 -1.426454 0.431945
C  2.193177 -0.141268 3.104183
C  1.711566 -0.624586 1.895654
C  1.321086 0.143964 4.143152
C  0.349603 -0.824814 1.710025
C  -0.038886 -0.072911 3.971415
C  -0.52026 -0.560878 2.766415
C  -1.525754 -0.86229 -0.04038
C  -2.45598 -1.807638 -0.618845
C  -1.921628 0.426542 -0.017455
N  -3.682699 -1.315976 -0.977551
N  -3.147541 0.827955 -0.424669
C  -4.096907 -0.024005 -0.899549
N  1.862967 -2.720965 -2.438817
C  2.55451 -1.647341 -2.914062
C  1.012016 -2.644346 -1.393366
N  2.26997 -0.486145 -2.267785
C  0.754999 -1.50189 -0.722048
C  1.38495 -0.308725 -1.236528
H  0.44788 -4.594896 -1.767075
H  -0.695323 -3.662705 -0.926586
H  -0.075159 1.290851 0.022607
H  -1.357144 2.401565 0.107278
H  -0.45695 -2.451075 0.719557
H  3.259387 0.011983 3.229317
H  2.417669 -0.853041 1.105895
H  -0.731263 0.130913 4.780585
H  -1.584805 -0.74166 2.652735
H  2.727954 0.351823 -2.612571
H  2.019533 -3.608538 -2.906477
H  -3.404295 1.808794 -0.36758
H  -4.342775 -1.987308 -1.356499
H  -0.980875 1.507805 1.454246
H  0.703669 -4.26052 -0.168814
elementType: S H N O C
totalener: -1855.06717989 hartree
nucrepener: 2573.05776799 hartree
electener: -4428.12494787 hartree
oneelecener: -7604.22770338 hartree
twoeener: 3176.10275551 hartree
cpcmener: -0.37335651 hartree
kineticenergy: 1848.02717085 hartree
exchangeener: -141.588974040466 hartree
correlationener: -6.797215329379 hartree
xcener: -148.386189369845 hartree
chargesum: 2.0000000
charge: -0.214268 -0.220800 -0.621460 -0.644965 -0.661765 -1.041906 -1.005613 1.200125 -0.268305 0.968379 0.625481 1.964195 -0.264674 0.700482 1.356859 0.810426 0.542101 -0.563673 -0.374787 0.442172 -0.490753 0.381893 1.402121 -0.390740 0.189459 0.120460 0.291074 0.259759 0.264530 0.294902 -0.488593 -0.705773 -0.945502 -0.697682 -1.010161 0.032379 0.015258 -0.013698 0.058575 0.372422 0.332068
charge: 0.565759 0.560392 0.018270 0.537393 0.530062 0.167800 0.155109 -0.060975 0.020663 0.056235 0.011049 -0.144499 0.020229 0.046388 -0.001197 -0.257341 -0.069406 0.183050 0.183967 -0.692223 0.185979 -0.691180 -0.059227 0.185682 -0.007437 -0.264081 0.118056 -0.038305 -0.053516 0.118749 0.064039 0.020710 0.023547 0.021366 0.037809 0.065630 0.074952 0.073685 0.065058 0.096259 0.131500
qa: -0.2143 -0.2208 -0.6215 -0.6450 -0.6618 -1.0419 -1.0056 1.2001 -0.2683 0.9684 0.6255 1.9642 -0.2647 0.7005 1.3569 0.8104 0.5421 -0.5637 -0.3748 0.4422 -0.4908 0.3819 1.4021 -0.3907 0.1895 0.1205 0.2911 0.2598 0.2645 0.2949 -0.4886 -0.7058 -0.9455 -0.6977 -1.0102 0.0324 0.0153 -0.0137 0.0586 0.3724 0.3321
va: 1.7921 1.7848 0.4277 2.8079 2.9507 1.3111 1.3256 1.3304 3.1233 -1.2953 3.0033 3.9482 3.2580 -2.1491 0.8423 -1.2885 -2.6810 2.7825 2.4594 3.1438 2.7835 3.2507 -7.6151 2.7812 2.7125 1.9602 0.7186 0.9548 0.9068 0.7131 0.5744 0.4340 -0.3190 0.4338 -0.2222 0.8640 0.8529 0.8652 0.8463 0.7427 0.8028
energy: 29909.5 30033.0 32364.6 33389.0 33739.5 33963.6 34329.0 35540.9 36081.0 36377.9 36770.0 36822.7 37611.5 38574.6 38896.0 39747.2 40529.9 40680.0 41004.6 41236.4 42124.7 42769.6 43176.1 43601.4 44137.0 44345.2 45020.5 45267.3 45422.7 45896.0 46655.9 47040.9 47713.3 47765.8 47789.4 47863.8 47932.8 47973.1 48264.1 48279.4 49414.4 49622.1 49760.0 49822.3 49950.3 50276.3 50505.8 50681.1 50877.4 51646.2 51767.2 51879.2 52025.5 52294.7 52319.1 52450.2 52568.4 52670.8 52796.4 53257.7 53472.6 53532.6 53827.6 54143.3 54176.7 54274.7 54335.9 54500.5 54638.3 54732.3 54791.2 54976.0 55160.5 55244.8 55373.6 55973.6 56160.0 56252.4 56314.5 56389.3 56556.2 56575.7 56625.3 56854.6 56906.0 56985.9 57073.9 57131.2 57356.3 57390.2 57454.7 57533.7 57680.8 57865.1 57934.3 58008.9 58204.8 58337.4 58453.3 58545.5 58653.5 58705.8 58873.1 58920.2 59319.1 59430.0 59503.7 59559.2 59587.6 59657.3 59831.6 59911.8 60017.6 60175.4 60210.7 60336.5 60425.1 60444.1 60608.7 60656.6 60784.2 60813.4 61095.9 61138.8 61154.7 61219.4 61288.5 61350.0 61455.1 61464.7 61508.6 61539.1 61595.6 61790.5 61844.5 61915.0 61977.3 62043.1 62094.6 62202.9 62264.4 62364.9 62524.9 62557.3 62594.8 62673.7 62741.3 62830.0 62888.3 63037.9 63095.5 63127.4 63329.6 63411.5 63496.5 63526.7 63546.3 63646.9 63697.9 63783.5 63805.0 63894.1 63921.7 63974.8 64021.9 64058.3 64136.7 64216.2 64353.6 64418.9 64464.9 64549.6 64592.0 64638.4 64779.6 64831.0 64866.2 64987.5 65002.9 65031.3 65055.0 65120.8 65183.1 65242.1 65340.6 65514.6 65595.5 65688.1 65745.5 65798.4 65918.8 65929.9 66140.9 66263.8 66311.8 66359.5 66418.7 66453.7 66569.4 66596.4
energy: -1854.988271982986
dipole: 4.54815 -4.14976 0.39839 -0.60832 -1.17467 -1.78299 15.19702 -13.42185 1.77518
magnitude: 2.54735 au
magnitude: 6.47486 debye
