program: Orca
programVersion: 5.0.4
elementType: S S H N N O O C C C C C C C C C C N N C N C C N C C H H H H H H H H H
keywords: PBE0 ma-def2-TZVP AutoAux D4 VeryTightSCF TightOPT MORead
charge: -4
multiplicity: 1
formula: C15H10N6O2S2
InChI: InChI=1/C15H10N6O2S2/c16-10-8(12(22)20-14(24)18-10)7(6-4-2-1-3-5-6)9-11(17)19-15(25)21-13(9)23/h1-5,7H,16-17H2
35 atoms
S  4.108721 -1.799807 -3.877096
S  -5.906018 0.226796 -0.69087
H  1.612292 0.248004 5.179453
N  0.292369 -3.655458 -1.306151
N  -1.144752 1.461315 -0.052295
O  1.531824 0.894555 -0.608344
O  -2.316229 -3.149671 -0.160583
C  -0.188066 -1.320834 0.308093
C  2.139499 -0.481287 3.214754
C  1.687362 -0.829873 1.951574
C  1.256184 -0.031783 4.190184
C  0.33134 -0.757399 1.620451
C  -0.089923 0.07225 3.863389
C  -0.541719 -0.282395 2.599902
C  -1.60508 -0.902069 -0.037603
C  -2.613962 -1.915147 -0.20256
C  -2.029309 0.415651 -0.189462
N  -3.912681 -1.537025 -0.395307
N  -3.307414 0.761771 -0.417115
C  -4.202926 -0.240878 -0.480158
N  1.996578 -2.653843 -2.485077
C  2.795159 -1.589763 -2.694584
C  1.052779 -2.516026 -1.542296
N  2.670035 -0.4129 -2.088451
C  0.846935 -1.351847 -0.807235
C  1.679641 -0.23747 -1.161048
H  0.361724 -4.277933 -2.096182
H  -0.665352 -3.508022 -0.960381
H  -0.146424 1.271003 -0.247445
H  -1.519687 2.30626 -0.452529
H  -0.33497 -2.377741 0.576351
H  3.202879 -0.546538 3.436885
H  2.382815 -1.160672 1.188609
H  -0.800883 0.440529 4.600965
H  -1.592402 -0.197255 2.343031
totalener: -1851.67451370 hartree
nucrepener: 2390.16475622 hartree
electener: -4241.83926992 hartree
oneelecener: -7378.42880930 hartree
twoeener: 3136.58953937 hartree
kineticenergy: 1845.96852696 hartree
exchangeener: -140.924663413998 hartree
correlationener: -6.739852968120 hartree
chargesum: -4.0000000
charge: -1.140946 -1.119570 0.090035 -0.447666 -0.357758 -0.614835 -0.712604 -0.342201 1.018797 0.088486 -3.630298 1.038146 1.215964 -0.344943 0.277553 0.280600 -0.102448 -0.498791 -0.498729 0.285936 -0.555884 0.348107 0.057702 -0.437711 0.145854 0.367091 0.196537 0.301837 0.307530 0.192276 0.137412 0.059907 0.166814 0.059801 0.167998
charge: -0.283955 -0.270840 0.155078 -0.151428 -0.118867 -0.169592 -0.200744 -0.174210 -0.244612 -0.116512 -0.362413 -0.122524 -0.242777 -0.124826 -0.157237 -0.438973 -0.358381 -0.025882 -0.047938 -0.651245 -0.051411 -0.649994 -0.348842 -0.021353 -0.158889 -0.446758 0.186492 0.209738 0.217901 0.187920 0.244002 0.161314 0.208155 0.161226 0.208378
qa: -1.1409 -1.1196 0.0900 -0.4477 -0.3578 -0.6148 -0.7126 -0.3422 1.0188 0.0885 -3.6303 1.0381 1.2160 -0.3449 0.2776 0.2806 -0.1024 -0.4988 -0.4987 0.2859 -0.5559 0.3481 0.0577 -0.4377 0.1459 0.3671 0.1965 0.3018 0.3075 0.1923 0.1374 0.0599 0.1668 0.0598 0.1680
va: 0.6069 0.6614 0.9199 2.5860 2.4359 1.5642 1.5624 3.2084 0.1063 4.6424 -0.7551 2.7648 -0.6779 5.6766 3.4680 4.0094 4.4877 2.5924 2.4471 3.9347 2.5452 3.7768 3.9610 2.5931 3.6543 3.9924 0.9853 0.9575 0.9673 0.9866 0.9905 0.9718 0.9405 0.9694 0.9517
energy: -1851.733919816075
dipole: 5.13275 -3.91774 1.21501 0.83607 -0.99164 -0.15557 15.64738 -11.46482 4.18256
magnitude: 4.35824 au
magnitude: 11.07776 debye
