program: Orca
programVersion: 5.0.4
elementType: S S H N N O O C C C C C C C C C C N N C N C C N C C H H H H H H H H H H H H H
keywords: PBE0 aug-cc-pVDZ AutoAux D4 VeryTightSCF
charge: 0
multiplicity: 1
formula: C15H14N6O2S2
InChI: InChI=1/C15H14N6O2S2/c16-10-8(12(22)20-14(24)18-10)7(6-4-2-1-3-5-6)9-11(17)19-15(25)21-13(9)23/h1-5,7,18-21H,16-17H2
39 atoms
S  4.228125 -4.010431 -2.141102
S  -5.790709 -1.552802 -1.250821
H  1.183781 3.879015 2.48407
N  1.193991 -0.145777 -1.835538
N  -1.973478 -3.163932 1.418299
O  0.794796 -3.659388 1.331512
O  -1.404336 0.599378 -1.430194
C  -0.139278 -1.04502 0.694504
C  1.903181 2.015984 1.693855
C  1.56081 0.763742 1.207292
C  0.918292 2.898194 2.107154
C  0.230583 0.370454 1.119215
C  -0.411159 2.509971 2.037461
C  -0.748571 1.257962 1.551366
C  -1.530664 -1.186154 0.125711
C  -2.03097 -0.296641 -0.865902
C  -2.350619 -2.209992 0.551476
N  -3.37076 -0.458287 -1.219985
N  -3.643471 -2.282691 0.099738
C  -4.218108 -1.412216 -0.778166
N  2.522277 -2.022223 -1.828391
C  2.994244 -3.221129 -1.385217
C  1.511706 -1.298949 -1.244237
N  2.346378 -3.687661 -0.295328
C  0.919676 -1.774557 -0.09154
C  1.304557 -3.059102 0.381296
H  2.980681 -1.677775 -2.657654
H  -4.253762 -3.021864 0.411948
H  1.609251 0.092132 -2.718592
H  0.296173 0.301031 -1.603501
H  -0.972309 -3.362363 1.530267
H  -2.602698 -3.922544 1.613103
H  2.63466 -4.588571 0.056923
H  -3.732585 0.193297 -1.901021
H  -0.160593 -1.58934 1.644396
H  2.947871 2.300372 1.750335
H  2.34353 0.081042 0.898404
H  -1.193261 3.186323 2.363084
H  -1.792261 0.96848 1.50814
totalener: -1854.17432693 hartree
nucrepener: 2508.68955432 hartree
electener: -4362.86388124 hartree
oneelecener: -7528.10404695 hartree
twoeener: 3165.24016571 hartree
kineticenergy: 1847.55282866 hartree
exchangeener: -141.488890422079 hartree
correlationener: -6.796754538023 hartree
xcener: -148.285644960101 hartree
chargesum: -0.0000000
charge: -0.203550 -0.199275 -0.615973 -0.024066 -0.056081 -0.895628 -0.940931 1.178396 -0.454315 1.169464 0.589113 1.381176 -0.496410 1.122761 1.407383 0.135445 0.309265 -0.355915 -0.416995 0.448429 -0.268365 0.440745 -0.617533 -0.446483 1.327377 0.735466 -0.100930 -0.062873 -0.127968 0.065746 -0.018992 -0.092364 -0.028535 -0.055836 -0.536131 -0.717290 -0.918321 -0.704825 -0.955180
charge: 0.572479 0.573305 0.006784 0.362076 0.354651 0.118357 0.137259 -0.085393 0.010048 0.047982 0.001934 -0.134869 0.012484 0.049631 -0.051236 -0.330777 -0.192334 0.149898 0.144854 -0.733133 0.146227 -0.732417 -0.203907 0.148973 -0.054800 -0.327276 0.025109 0.025391 0.004967 -0.098157 -0.099891 0.000833 0.034869 0.034786 0.037950 0.008554 0.011021 0.009329 0.014438
qa: -0.2036 -0.1993 -0.6160 -0.0241 -0.0561 -0.8956 -0.9409 1.1784 -0.4543 1.1695 0.5891 1.3812 -0.4964 1.1228 1.4074 0.1354 0.3093 -0.3559 -0.4170 0.4484 -0.2684 0.4407 -0.6175 -0.4465 1.3274 0.7355 -0.1009 -0.0629 -0.1280 0.0657 -0.0190 -0.0924 -0.0285 -0.0558 -0.5361 -0.7173 -0.9183 -0.7048 -0.9552
va: 1.8083 1.8132 0.4538 2.9757 3.0041 1.3914 1.4760 -0.1203 3.0574 -3.2316 3.0576 4.5833 3.2048 -3.9503 1.3680 2.3926 -1.8303 2.6825 2.6943 3.0741 2.5583 3.0625 0.9352 2.7670 1.6902 -0.4064 0.8807 0.8741 0.8734 0.8570 0.9956 0.8566 0.8857 0.8898 0.6814 0.4526 -0.1917 0.4620 -0.2227
energy: 31989.5 32052.3 34881.1 35500.5 37377.1 38090.4 38517.9 38923.4 39060.6 39371.6 39577.2 40576.3 40582.5 40946.5 41249.8 41445.0 41559.3 41852.0 42280.9 42609.6 42766.5 42940.8 43007.7 43187.2 43376.3 43547.1 43678.4 43842.6 43952.2 44252.7 44521.8 44817.9 44959.0 45302.7 45862.6 46050.3 46182.5 46344.2 46433.3 46448.6 46657.4 46925.8 46990.8 47075.7 47203.8 47383.1 47501.9 47604.3 47922.1 48006.6 48210.4 48260.3 48508.1 48557.2 48649.3 48724.0 48961.2 48981.5 49268.4 49315.8 49437.6 49497.0 49612.2 49738.3 49896.3 50196.1 50356.1 50421.2 50517.5 50715.3 51037.3 51137.1 51355.3 51481.8 51592.0 52015.7 52193.5 52296.2 52380.0 52467.0 52545.5 52623.7 52677.2 52743.5 52828.0 53091.4 53141.4 53416.2 53533.1 53699.8 53739.3 53799.3 53829.1 53869.8 53931.5 54094.3 54221.6 54245.4 54350.7 54496.5 54567.1 54618.9 54657.1 54744.2 54829.7 54871.4 54943.8 55071.2 55181.6 55309.9 55354.1 55490.7 55595.0 55869.9 55935.9 56017.9 56342.3 56383.4 56585.4 56632.6 56759.2 56782.0 56814.7 56934.6 57051.6 57098.8 57236.6 57338.9 57419.3 57517.0 57653.1 57791.1 57917.9 57959.5 58060.3 58133.5 58219.6 58325.8 58373.4 58476.4 58521.3 58547.2 58655.0 58742.1 58772.3 58810.1 58889.5 58915.3 59089.7 59172.4 59255.7 59304.6 59375.5 59408.1 59468.1 59495.2 59516.5 59687.7 59765.2 59940.7 60035.7 60093.9 60207.0 60259.2 60340.5 60444.8 60484.4 60552.1 60713.3 60799.0 60850.3 60866.3 61058.0 61145.8 61270.6 61324.3 61391.6 61423.2 61487.0 61543.2 61626.5 61780.2 61913.7 61994.6 62089.7 62128.8 62173.3 62249.6 62284.8 62370.6 62429.1 62460.8 62524.1 62606.4 62706.9 62730.3 62766.5 62821.7 62896.9 62917.2
energy: -1854.085861182954
dipole: 2.95195 -2.96065 -0.00870 9.74041 -9.48181 0.25860 7.61018 -7.35146 0.25872
magnitude: 0.36591 au
magnitude: 0.93006 debye
