program: Orca
programVersion: 5.0.4
elementType: S S H N N O O C C C C C C C C C C N N C N C C N C C H H H H H H H H H H H H H H H
keywords: PBE0 ma-def2-TZVP AutoAux D4 VeryTightSCF TightOPT MORead
charge: 2
multiplicity: 1
formula: C15H16N6O2S2
InChI: InChI=1/C15H16N6O2S2/c16-10-8(12(22)20-14(24)18-10)7(6-4-2-1-3-5-6)9-11(17)19-15(25)21-13(9)23/h1-5,7,18-23H,16-17H2
41 atoms
S  3.442503 -2.201748 -4.351746
S  -5.527013 1.197319 -1.209281
H  1.487899 0.011621 5.107662
N  1.534903 -3.587311 -0.020892
N  -0.939555 1.461507 0.600526
O  0.44828 0.680652 -1.881592
O  -2.598142 -2.652545 -1.183303
C  -0.321213 -1.424132 0.231083
C  1.913736 -0.028785 3.00659
C  1.461098 -0.402149 1.746123
C  1.13306 -0.274027 4.124841
C  0.2194 -1.01446 1.598886
C  -0.100812 -0.898486 3.985272
C  -0.556726 -1.264947 2.730143
C  -1.611575 -0.71659 -0.151668
C  -2.637559 -1.402511 -0.797742
C  -1.884746 0.633174 0.112388
N  -3.801352 -0.814964 -1.103543
N  -3.073055 1.166048 -0.216465
C  -4.123573 0.503558 -0.84086
N  2.35711 -2.805776 -2.014302
C  2.507541 -1.918442 -3.071752
C  1.547775 -2.636209 -0.952396
N  1.793609 -0.755801 -2.861677
C  0.724275 -1.49148 -0.865693
C  0.96565 -0.521253 -1.829112
H  2.135554 -4.394478 -0.092047
H  -1.756506 -3.083203 -0.992095
H  0.065575 0.990947 -1.040348
H  -1.192042 2.412624 0.832135
H  -0.633151 -2.467776 0.383459
H  2.881638 0.446721 3.110911
H  2.089089 -0.218598 0.880197
H  -0.70704 -1.104193 4.859342
H  -1.522892 -1.751195 2.632181
H  1.931719 -0.017679 -3.543214
H  2.945479 -3.627011 -2.089535
H  -3.275143 2.137605 -0.011809
H  -4.514122 -1.365143 -1.571753
H  -0.239433 1.04465 1.212375
H  1.181118 -3.384734 0.900811
totalener: -1855.02379052 hartree
nucrepener: 2571.13565056 hartree
electener: -4426.15944108 hartree
oneelecener: -7605.18346681 hartree
twoeener: 3179.02402573 hartree
kineticenergy: 1849.27042738 hartree
exchangeener: -141.688576415336 hartree
correlationener: -6.790458390489 hartree
xcener: -148.479034805825 hartree
chargesum: 2.0000000
charge: -0.153929 -0.144212 0.184771 -0.446506 -0.409699 -0.228785 -0.237432 1.196858 -0.339559 0.546195 0.233729 -0.825743 -0.255842 0.125243 -1.494751 0.152901 0.530080 -0.165608 -0.163337 -0.028047 -0.127653 -0.031157 0.372876 -0.158709 -0.780029 0.531770 0.301768 0.363856 0.391582 0.301026 0.180154 0.179985 0.183819 0.180626 0.174275 0.311109 0.285235 0.285922 0.312617 0.343799 0.320803
charge: 0.479549 0.491975 0.196798 0.042142 0.008473 0.136226 0.157481 -0.181519 -0.126468 -0.163438 -0.110693 -0.228926 -0.115655 -0.132904 -0.133748 -0.271972 -0.261819 0.164419 0.143740 -0.622718 0.138705 -0.626054 -0.251955 0.157029 -0.141510 -0.287999 0.229794 0.248880 0.245307 0.230919 0.228651 0.195836 0.206514 0.196536 0.203473 0.274376 0.263261 0.264610 0.276421 0.242297 0.233966
qa: -0.1539 -0.1442 0.1848 -0.4465 -0.4097 -0.2288 -0.2374 1.1969 -0.3396 0.5462 0.2337 -0.8257 -0.2558 0.1252 -1.4948 0.1529 0.5301 -0.1656 -0.1633 -0.0280 -0.1277 -0.0312 0.3729 -0.1587 -0.7800 0.5318 0.3018 0.3639 0.3916 0.3010 0.1802 0.1800 0.1838 0.1806 0.1743 0.3111 0.2852 0.2859 0.3126 0.3438 0.3208
va: 2.1346 2.1495 0.9509 3.1615 2.9946 2.2725 2.2949 0.2062 4.1214 2.6590 3.3646 3.6162 4.3323 3.7598 4.0144 4.0818 3.3056 3.1801 3.2736 4.3355 3.1178 4.3639 3.8962 3.2444 3.9830 3.5666 0.9267 0.9001 0.8571 0.9314 0.8985 0.9521 0.9410 0.9530 0.9454 0.9172 0.9353 0.9363 0.9171 0.9092 0.9136
energy: -1855.084999799717
dipole: 6.39752 -5.80627 0.59125 -1.24957 0.58965 -0.65992 17.46446 -15.72262 1.74184
magnitude: 1.95425 au
magnitude: 4.96730 debye
