program: Orca
programVersion: 5.0.4
elementType: S S H N N O O C C C C C C C C C C N N C N C C N C C H H H H H H H H H
keywords: PBE0 aug-cc-pVDZ AutoAux D4 VeryTightSCF
charge: -4
multiplicity: 1
formula: C15H10N6O2S2
InChI: InChI=1/C15H10N6O2S2/c16-10-8(12(22)20-14(24)18-10)7(6-4-2-1-3-5-6)9-11(17)19-15(25)21-13(9)23/h1-5,7H,16-17H2
35 atoms
S  3.862173 -1.532595 -4.036337
S  -5.806716 0.051941 -1.037142
H  1.680416 0.3562 5.181497
N  0.186815 -3.541087 -1.423965
N  -1.13117 1.384322 -0.180904
O  1.606154 0.892817 -0.403292
O  -2.306825 -3.219366 0.080199
C  -0.16731 -1.365195 0.394487
C  2.145489 -0.635728 3.327344
C  1.669476 -1.044725 2.092484
C  1.309085 0.030589 4.215548
C  0.349942 -0.803341 1.707731
C  -0.006414 0.270852 3.849449
C  -0.479157 -0.145918 2.610465
C  -1.57912 -0.970735 0.022329
C  -2.576169 -1.975316 -0.097289
C  -1.991526 0.330674 -0.260834
N  -3.852777 -1.639776 -0.416562
N  -3.258362 0.645242 -0.58967
C  -4.150295 -0.3557 -0.642151
N  1.850039 -2.488928 -2.595018
C  2.654359 -1.428627 -2.772949
C  0.958375 -2.419958 -1.592885
N  2.583442 -0.306272 -2.051523
C  0.831721 -1.31809 -0.746938
C  1.670471 -0.21357 -1.048873
H  0.206844 -4.179022 -2.203921
H  -0.707639 -3.460209 -0.940242
H  -0.120273 1.210362 -0.212657
H  -1.458757 2.232515 -0.615212
H  -0.265721 -2.430729 0.631859
H  3.177049 -0.836522 3.5991
H  2.333854 -1.558444 1.40481
H  -0.675114 0.786382 4.5316
H  -1.512017 0.042456 2.340331
elementType: S H N O C
totalener: -1852.27808158 hartree
nucrepener: 2400.22708280 hartree
electener: -4252.50516438 hartree
oneelecener: -7405.09555671 hartree
twoeener: 3152.59039233 hartree
cpcmener: -0.89375691 hartree
kineticenergy: 1845.26816188 hartree
exchangeener: -141.007899822632 hartree
correlationener: -6.777701544945 hartree
xcener: -147.785601367577 hartree
chargesum: -4.0000000
charge: -0.653351 -0.656218 -0.624888 -0.221584 -0.157175 -1.221315 -1.149740 0.865456 -0.497958 1.105029 0.570763 1.540859 -0.420972 1.292034 0.219115 0.844864 0.253567 -0.819168 -0.760763 -0.022924 -0.726049 0.023402 0.201128 -0.844006 1.028992 0.981253 -0.027572 -0.130662 -0.080126 -0.060617 -0.471059 -0.710106 -0.989900 -0.726358 -0.953953
charge: 0.052736 0.051954 0.006148 0.286659 0.291063 -0.066739 -0.092785 -0.117647 -0.013048 0.029586 -0.023415 -0.150005 -0.011372 0.032979 -0.105928 -0.515946 -0.358279 -0.064884 -0.034373 -0.932266 -0.035608 -0.931052 -0.348292 -0.060492 -0.097674 -0.511367 -0.023909 -0.132962 -0.149257 -0.023403 0.009918 0.009467 0.016943 0.009379 0.003871
qa: -0.6534 -0.6562 -0.6249 -0.2216 -0.1572 -1.2213 -1.1497 0.8655 -0.4980 1.1050 0.5708 1.5409 -0.4210 1.2920 0.2191 0.8449 0.2536 -0.8192 -0.7608 -0.0229 -0.7260 0.0234 0.2011 -0.8440 1.0290 0.9813 -0.0276 -0.1307 -0.0801 -0.0606 -0.4711 -0.7101 -0.9899 -0.7264 -0.9540
va: 1.3503 1.3426 0.4270 2.9518 2.9561 1.2270 1.1058 1.8168 3.5565 -3.1250 3.1770 4.1068 3.1423 -2.1549 3.7394 -0.4937 0.9894 2.0019 1.9331 3.1092 2.0915 3.0754 -0.5043 1.8010 1.8525 0.1609 0.8625 1.0828 0.9652 0.8846 0.6453 0.4220 -0.2012 0.4278 -0.3166
energy: 31194.2 31690.7 32246.9 33047.0 33737.6 33804.1 34404.5 34504.4 34652.7 35066.5 35209.9 35469.8 35730.8 35793.3 36164.2 36348.0 36672.5 36726.8 37062.5 37136.9 37423.0 37484.3 37564.3 37927.3 38498.6 38715.1 38872.2 38941.2 39090.1 39256.0 39471.7 39540.1 39604.9 39701.5 39830.4 39892.0 39942.8 40309.2 40394.9 40454.7 40602.5 40679.0 40870.6 41002.8 41371.7 41670.8 41851.1 41918.9 41937.8 42052.6 42105.9 42121.0 42207.4 42338.4 42441.4 42468.8 42582.0 42838.8 42911.7 42958.2 43101.4 43177.0 43292.8 43344.0 43435.5 43491.5 43500.8 43545.6 43685.3 43887.5 44019.7 44087.1 44105.5 44212.4 44261.4 44329.3 44376.4 44395.2 44525.6 44572.4 44663.8 44737.9 44830.5 44962.3 45210.7 45293.2 45310.3 45412.9 45500.8 45607.0 45662.6 45737.2 45850.0 45966.8 46102.3 46177.4 46276.7 46311.1 46438.1 46473.7 46504.5 46561.2 46600.3 46721.2 46780.1 46848.6 46892.8 46956.8 47099.6 47163.1 47237.5 47283.4 47290.8 47414.9 47468.1 47485.1 47600.3 47638.8 47688.1 47762.8 47812.5 47864.0 47920.2 47941.2 48026.0 48043.0 48084.5 48209.2 48244.2 48370.6 48434.5 48484.1 48652.5 48675.5 48725.7 48788.7 48861.2 48982.8 49011.4 49048.7 49193.3 49247.3 49361.9 49439.7 49502.2 49640.7 49647.1 49746.0 49816.2 49879.6 49914.8 49967.7 49988.4 50039.3 50084.2 50195.9 50225.2 50268.0 50280.2 50386.6 50411.6 50523.8 50608.0 50671.9 50758.7 50804.8 50813.5 50867.2 50993.1 51078.0 51089.8 51110.1 51169.3 51276.0 51301.0 51348.5 51407.7 51458.9 51529.4 51616.9 51711.0 51740.2 51763.4 51806.9 51826.4 51927.4 51961.0 51998.2 52050.0 52161.8 52191.8 52221.2 52268.7 52393.1 52412.0 52507.9 52587.4 52650.6 52690.8 52746.7
energy: -1852.195655284215
dipole: 5.40742 -2.53390 2.87352 0.74643 -0.44522 0.30121 16.08413 -7.89939 8.18475
magnitude: 8.67974 au
magnitude: 22.06215 debye
