program: Gaussian 09
title: 000050414
version: EM64L-G09RevD.01
frameworkgroup: C1[X(C12H18N2O2)]
method: RPBEPBE
basis: SDD
operation: Freq
keyword: #p
keyword: freq=noraman
keyword: PBEPBE/SDD
title: #p freq=noraman PBEPBE/SDD
converged: YES YES NO NO
title: Mulliken charges:
elementType: O O N N C C C C C C C C C C C C H H H H H H H H H H H H H H H H H H
charge: -0.310882 -0.270372 -0.315027 -0.397388 -0.204245 -0.406077 0.506721 -0.695071 -0.447649 -0.372040 -0.232617 -0.244240 -0.245037 0.347315 -0.217008 -0.675426 0.190498 0.182934 0.239030 0.275954 0.219536 0.201792 0.244515 0.229346 0.295338 0.306197 0.222401 0.228572 0.225581 0.227179 0.224521 0.209700 0.226696 0.229252
chargesum: 0.00000
title: Mulliken charges with hydrogens summed into heavy atoms:
elementType: O O N N C C C C C C C C C C C C
charge: -0.310882 -0.270372 -0.039073 -0.091191 -0.013747 0.015887 0.506721 -0.029228 -0.218303 -0.076702 -0.010216 -0.015668 -0.019456 0.347315 0.234692 -0.009777
polarizability: 1.51601430e+02 7.70915448e+00 1.56589803e+02 1.19712841e+01 3.10282376e+00 1.31354904e+02
1716.lowfreq: -4.8768 -0.0006 -0.0004 0.0005 3.8974 10.0786 22.8424 38.8849 42.9401
frequency: 22.8163 38.8691 42.9285 60.3834 74.7432 84.1328 105.2174 129.0383 151.3403 178.4798 206.2622 239.8784 249.4651 261.8320 292.7863 324.5590 364.8441 385.0987 407.4938 437.8872 500.9552 537.1555 565.8800 605.7267 616.1439 667.5645 695.8572 709.0061 720.6939 738.3899 769.4361 801.1541 828.9753 857.4709 860.2856 908.2984 933.3988 959.3223 981.3101 989.9490 1002.8465 1014.8039 1025.7558 1043.1897 1047.4485 1080.7522 1097.5954 1109.2918 1128.7973 1139.4596 1141.1154 1171.0313 1187.3619 1217.0776 1232.4053 1247.2770 1248.9495 1286.7162 1306.1833 1331.9118 1347.5119 1358.9680 1387.2820 1392.9742 1399.2111 1441.3101 1449.3895 1462.6527 1464.1847 1477.9370 1478.1198 1484.0153 1487.6259 1490.7288 1511.0671 1594.6208 1613.9828 1687.9041 2853.4341 2958.1066 2981.2746 2994.0298 3005.2894 3038.7500 3062.4346 3075.0378 3087.7799 3091.0556 3104.7397 3107.7810 3123.9610 3137.1976 3150.6962 3162.3421 3435.7810 3443.1389
redmass: 3.6436 3.1914 2.9937 3.2304 3.5003 5.2878 2.7362 2.9234 3.2086 3.4896 3.6308 1.5988 1.1794 2.2760 3.7716 4.8741 3.2336 3.3837 2.8575 2.3975 2.2920 3.4709 2.9370 1.4388 6.3173 3.8496 7.3966 1.7590 3.5761 2.0756 1.8859 1.0952 1.5914 2.9488 1.2972 1.9700 1.5041 4.2249 1.4700 3.6079 1.4388 2.6989 2.1288 2.1028 2.7276 1.6570 2.2508 2.3583 2.3497 1.5146 4.1381 1.0537 1.1170 2.1224 2.8157 1.3896 1.1338 1.1869 1.4294 1.3823 1.3893 1.3394 5.4491 1.2160 1.2669 1.9274 1.3621 1.0409 1.1138 1.0505 1.0522 2.0559 1.0743 1.0986 1.5008 6.0468 5.9978 9.6449 1.0815 1.0649 1.0370 1.0357 1.0580 1.0951 1.1068 1.0989 1.1000 1.0985 1.1024 1.0872 1.0866 1.0917 1.0954 1.1007 1.0773 1.0748
irintensity: 0.7045 0.1124 0.6924 0.2740 0.7569 7.8472 3.8477 2.3788 2.9859 0.6466 4.0537 1.5159 0.5331 2.4372 0.8352 9.2444 6.5994 0.2030 0.3576 35.9862 56.4950 11.4111 33.9759 84.1427 0.0415 8.3259 21.2879 62.5571 38.7101 3.1301 49.3104 3.4037 13.1642 0.9466 1.4287 19.6088 1.1988 42.0871 0.7101 0.1181 3.6399 6.6120 4.4336 50.7222 50.2867 17.1641 7.5461 55.1186 11.2891 26.5207 397.4867 0.0967 1.5173 10.8547 30.0768 3.9367 0.2212 2.0834 6.9367 5.0350 9.1722 1.9167 2.2248 13.6884 25.8945 6.5318 35.3757 11.1416 2.6927 11.2090 5.9947 17.2334 15.8983 12.7693 84.9732 1.0382 2.4574 226.3566 69.7306 58.9310 32.1424 23.0758 24.6635 11.2392 10.8323 47.2556 42.1233 32.6280 47.6025 9.8854 2.6468 29.4261 16.7740 21.8454 0.9737 24.8498
temp: 298.150 k
press: 1.00000 atm
elementType: 8 8 7 7 6 6 6 6 6 6 6 6 6 6 6 6 1 1 1 1 1 1 1 1 1 1 1 1 1 1 1 1 1 1
symmnumber: 1
zpe: 745915.4 jmol-1
zpe.correction: 0.284104 hartree
zpe.thermalcorrener: 0.301200 hartree
zpe.thermalcorrenthalpy: 0.302145 hartree
zpe.thermalcorrgfe: 0.237350 hartree
zpe.sumelectzpe: -726.779687 hartree
zpe.sumelectthermal: -726.762590 hartree
zpe.sumelectthermalent: -726.761646 hartree
zpe.sumelectthermalfe: -726.826441 hartree
dipole: -0.4139 -0.9559 -2.7341
dipole: 2.9258
quadrupole: -87.7138 -85.4736 -97.5789
quadrupole: 4.5702 -0.3346 3.5776
quadrupole: 2.5416 4.7819 -7.3235 4.5702 -0.3346 3.5776
hfenergy: -727.0637909 hartree
pointgroup: C01 [X(C12H18N2O2)]
dipole: -0.1474479 -0.3051372 -1.1000777 debye
polarizability: 150.5756951|6.2159364|157.3153449|11.6598976|6.277214|131.6550975 unknown
InChI: InChI=1S/C12H18N2O2/c1-3-11(10-8-6-5-7-9-10)13-14-12(15)16-4-2/h5-9,11,13-14H,3-4H2,1-2H3
charge 0 multiplicity 1
34 atoms
O  3.069308 -0.112693 -0.614711
O  2.073749 -0.526564 1.485628
N  0.026341 -1.924564 -0.010011
N  1.175845 -1.33647 -0.558468
C  -1.279376 -1.418192 -0.50588
C  -2.376113 -2.313698 0.141458
C  -1.466971 0.060775 -0.167126
C  -3.791805 -2.053607 -0.409556
C  -2.110004 0.925939 -1.085875
C  -1.048686 0.57429 1.086561
C  -2.351128 2.279588 -0.756127
C  -1.28482 1.92684 1.415537
C  -1.941106 2.78334 0.499568
C  2.080677 -0.649325 0.240288
C  4.139879 0.658206 0.07342
C  5.097534 1.141677 -1.011927
H  -1.364545 -1.531466 -1.616922
H  -2.109331 -3.378465 -0.03258
H  -2.352152 -2.14915 1.234913
H  0.087164 -2.950616 0.014647
H  -4.52692 -2.716073 0.081743
H  -3.841712 -2.243428 -1.498695
H  -4.103216 -1.009375 -0.232355
H  -2.421364 0.539965 -2.065541
H  -0.507518 -0.082558 1.776344
H  1.326939 -1.301957 -1.574141
H  -2.850288 2.937847 -1.476511
H  -0.94859 2.315072 2.383705
H  -2.121922 3.833177 0.757696
H  3.672663 1.494865 0.624282
H  4.635437 -0.002178 0.808425
H  5.916079 1.727425 -0.554936
H  5.540982 0.289271 -1.554848
H  4.573971 1.785001 -1.739804
