program: Orca
programVersion: 5.0.4
elementType: S S H N N O O C C C C C C C C C C N N C N C C N C C H H H H H H H H H H H H H H H
keywords: PBE0 aug-cc-pVDZ AutoAux D4 VeryTightSCF
charge: 2
multiplicity: 1
formula: C15H16N6O2S2
InChI: InChI=1/C15H16N6O2S2/c16-10-8(12(22)20-14(24)18-10)7(6-4-2-1-3-5-6)9-11(17)19-15(25)21-13(9)23/h1-5,7,18-21H,16-17H3
41 atoms
S  3.614715 -1.769505 -4.162569
S  -5.585432 0.49505 -1.379741
H  1.696424 0.527154 5.085498
N  0.346687 -3.874986 -1.022276
N  -1.044546 1.472954 0.445871
O  1.146956 0.836804 -0.852232
O  -2.193054 -2.988399 -0.83971
C  -0.210963 -1.425663 0.434082
C  2.189324 -0.123146 3.099374
C  1.708279 -0.607139 1.890739
C  1.318847 0.144317 4.144186
C  0.348382 -0.825061 1.71187
C  -0.038935 -0.09139 3.978981
C  -0.519704 -0.580004 2.774366
C  -1.525763 -0.859548 -0.041028
C  -2.448301 -1.800659 -0.639749
C  -1.920833 0.429741 -0.011098
N  -3.670877 -1.303622 -1.006211
N  -3.141355 0.835366 -0.426612
C  -4.085372 -0.011864 -0.919509
N  1.865178 -2.730582 -2.425035
C  2.545896 -1.65622 -2.913315
C  1.015889 -2.64987 -1.379692
N  2.24832 -0.489469 -2.282447
C  0.750502 -1.502304 -0.720249
C  1.364687 -0.307258 -1.250758
H  0.457483 -4.606703 -1.731712
H  -0.688576 -3.66275 -0.90633
H  -0.074018 1.279793 0.035707
H  -1.349045 2.401847 0.135261
H  -0.458463 -2.450283 0.721356
H  3.253799 0.044015 3.219858
H  2.413766 -0.823646 1.097226
H  -0.729586 0.097325 4.793062
H  -1.58154 -0.77755 2.665546
H  2.696432 0.346221 -2.643493
H  2.030044 -3.622938 -2.880929
H  -3.39684 1.816351 -0.36339
H  -4.328245 -1.963903 -1.407788
H  -0.975137 1.493784 1.472027
H  0.706334 -4.255461 -0.137037
elementType: S H N O C
totalener: -1855.07002498 hartree
nucrepener: 2574.27958373 hartree
electener: -4429.34960871 hartree
oneelecener: -7606.87793906 hartree
twoeener: 3177.52833035 hartree
cpcmener: -0.36830122 hartree
kineticenergy: 1848.04556932 hartree
exchangeener: -141.590746675080 hartree
correlationener: -6.798117405930 hartree
xcener: -148.388864081010 hartree
chargesum: 2.0000000
charge: -0.213496 -0.219940 -0.622264 -0.633872 -0.655870 -1.003239 -0.965917 1.238237 -0.260997 0.992505 0.632395 1.945848 -0.261964 0.693937 1.342446 0.738252 0.570939 -0.552150 -0.377237 0.445589 -0.486453 0.378201 1.379468 -0.375470 0.157798 0.118731 0.291248 0.235436 0.248260 0.292714 -0.524064 -0.707107 -0.944005 -0.696274 -1.014535 0.029012 0.017047 -0.011055 0.057772 0.379149 0.340924
charge: 0.566245 0.560793 0.018380 0.535905 0.528341 0.176469 0.162833 -0.064101 0.021346 0.057663 0.011795 -0.145412 0.021071 0.047764 -0.003713 -0.259898 -0.070323 0.182841 0.185183 -0.690200 0.187170 -0.689195 -0.060007 0.185396 -0.009728 -0.265078 0.119873 -0.046649 -0.061688 0.120136 0.062329 0.020809 0.023703 0.021557 0.038690 0.064198 0.076321 0.075106 0.064056 0.096987 0.133035
qa: -0.2135 -0.2199 -0.6223 -0.6339 -0.6559 -1.0032 -0.9659 1.2382 -0.2610 0.9925 0.6324 1.9458 -0.2620 0.6939 1.3424 0.7383 0.5709 -0.5522 -0.3772 0.4456 -0.4865 0.3782 1.3795 -0.3755 0.1578 0.1187 0.2912 0.2354 0.2483 0.2927 -0.5241 -0.7071 -0.9440 -0.6963 -1.0145 0.0290 0.0170 -0.0111 0.0578 0.3791 0.3409
va: 1.7931 1.7859 0.4257 2.8152 2.9564 1.3605 1.3794 1.2655 3.1130 -1.2278 2.9891 3.8946 3.2980 -2.0802 0.8759 -1.1022 -2.5884 2.7663 2.4800 3.1402 2.7836 3.2511 -7.3594 2.7591 2.8807 1.9504 0.7239 0.9871 0.9294 0.7187 0.5382 0.4317 -0.3163 0.4345 -0.2164 0.8655 0.8530 0.8647 0.8464 0.7377 0.7962
energy: 29772.4 29892.9 32115.2 33281.4 33670.3 33889.8 34255.2 35565.0 35894.6 36277.6 36514.6 36688.3 37616.3 38511.5 38859.7 39680.7 40401.1 40610.2 40948.7 41162.9 42055.7 42653.8 43111.2 43516.6 44077.6 44227.2 44923.8 45129.5 45241.9 45888.5 46813.8 47099.3 47689.3 47762.5 47769.1 47849.3 47943.1 48040.6 48234.4 48337.5 49338.9 49687.5 49753.9 49818.8 50019.1 50261.0 50554.7 50718.7 50992.5 51656.2 51758.5 51867.8 51998.0 52253.9 52298.1 52418.2 52560.4 52617.9 52795.4 53308.7 53498.3 53531.3 53850.9 53942.6 54092.5 54215.7 54285.2 54466.8 54637.5 54720.1 54768.2 54957.5 55137.2 55201.8 55219.7 56003.4 56122.3 56233.8 56275.2 56367.6 56509.5 56552.4 56584.3 56806.3 56845.6 56973.4 57002.6 57104.1 57350.3 57415.9 57441.6 57509.3 57670.0 57834.6 57927.4 57972.9 58181.3 58352.3 58423.0 58572.6 58692.3 58722.0 58877.6 58962.5 59271.3 59431.3 59507.5 59552.9 59580.2 59692.3 59714.1 59931.1 60030.3 60123.1 60194.7 60264.5 60267.4 60402.4 60591.8 60629.3 60780.9 60824.1 61048.6 61085.1 61108.5 61147.8 61253.1 61275.5 61411.4 61427.6 61465.3 61511.7 61567.1 61807.6 61837.7 61902.2 61938.0 62036.9 62083.9 62151.8 62221.8 62327.6 62466.8 62534.6 62565.2 62693.5 62723.9 62786.0 62914.2 63018.5 63078.7 63112.6 63306.1 63365.1 63453.0 63493.1 63529.9 63633.9 63701.7 63771.6 63787.5 63859.9 63944.3 63950.3 63996.2 64050.2 64062.2 64207.0 64298.0 64421.6 64432.0 64541.0 64611.6 64641.3 64743.2 64813.8 64837.2 64898.4 64986.6 65012.4 65066.0 65082.2 65183.7 65253.2 65355.6 65507.4 65585.8 65657.9 65729.6 65774.7 65926.0 65931.2 66119.7 66229.4 66288.5 66330.2 66384.3 66427.2 66516.6 66538.7
energy: -1854.991793669560
dipole: 4.57874 -4.13591 0.44283 -0.65056 -1.14583 -1.79639 15.37230 -13.44349 1.92882
magnitude: 2.67272 au
magnitude: 6.79351 debye
