program: Orca
programVersion: 5.0.4
elementType: S S H N N O O C C C C C C C C C C N N C N C C N C C H H H H H H H H H
keywords: PBE0 ma-def2-TZVP AutoAux D4 VeryTightSCF TightOPT MORead
charge: -4
multiplicity: 1
formula: C15H10N6O2S2
InChI: InChI=1/C15H10N6O2S2/c16-10-8(12(22)20-14(24)18-10)7(6-4-2-1-3-5-6)9-11(17)19-15(25)21-13(9)23/h1-5,7H,16-17H2
35 atoms
S  3.843807 -1.504622 -4.050036
S  -5.79665 0.027305 -1.035244
H  1.668617 0.357547 5.190379
N  0.160505 -3.511879 -1.451285
N  -1.116732 1.364391 -0.22634
O  1.630262 0.889611 -0.371531
O  -2.301988 -3.228049 0.141659
C  -0.158416 -1.368887 0.400331
C  2.137303 -0.651176 3.346808
C  1.666474 -1.062052 2.110811
C  1.301426 0.030885 4.223751
C  0.353036 -0.8068 1.714794
C  -0.008006 0.28491 3.845938
C  -0.475826 -0.134012 2.60569
C  -1.571906 -0.982362 0.029082
C  -2.570893 -1.985518 -0.063105
C  -1.981486 0.31372 -0.277453
N  -3.848768 -1.655866 -0.384392
N  -3.248746 0.625715 -0.60858
C  -4.143076 -0.374972 -0.636885
N  1.827823 -2.460982 -2.618722
C  2.645285 -1.407388 -2.781538
C  0.944896 -2.398145 -1.608249
N  2.592419 -0.295669 -2.040459
C  0.837659 -1.310548 -0.74282
C  1.684364 -0.210776 -1.032483
H  0.157229 -4.133579 -2.243644
H  -0.7190 -3.429709 -0.943831
H  -0.107004 1.18647 -0.23114
H  -1.438215 2.204665 -0.678353
H  -0.247884 -2.43542 0.634193
H  3.163441 -0.862668 3.628845
H  2.329348 -1.587301 1.430678
H  -0.675193 0.812584 4.519455
H  -1.503764 0.065079 2.324545
totalener: -1852.54054270 hartree
nucrepener: 2401.74853983 hartree
electener: -4254.28908252 hartree
oneelecener: -7409.69314871 hartree
twoeener: 3155.40406619 hartree
cpcmener: -0.91372277 hartree
kineticenergy: 1846.48655208 hartree
exchangeener: -141.075857197986 hartree
correlationener: -6.764369735185 hartree
xcener: -147.840226933172 hartree
elementType: S H N O C
chargesum: -4.0000000
charge: -0.925931 -0.929521 0.171276 -0.671718 -0.592620 -0.826998 -0.890282 -0.459199 -0.298077 0.177934 0.019520 -0.894391 -0.247094 0.237617 0.198484 0.283921 -0.005485 -0.712151 -0.684708 0.420143 -0.689414 0.469345 -0.068723 -0.660333 1.286133 0.273264 0.290597 0.294314 0.300404 0.286569 0.127725 0.169920 0.185353 0.169326 0.194799
charge: -0.199106 -0.199696 0.182945 -0.104638 -0.091834 -0.263671 -0.295751 -0.181917 -0.186604 -0.142902 -0.197575 -0.160206 -0.185238 -0.151234 -0.179555 -0.459940 -0.357645 -0.085798 -0.078243 -0.689983 -0.077759 -0.689135 -0.348008 -0.079355 -0.173638 -0.459426 0.209925 0.207314 0.211947 0.210251 0.235858 0.185158 0.204182 0.185015 0.206264
qa: -0.9259 -0.9295 0.1713 -0.6717 -0.5926 -0.8270 -0.8903 -0.4592 -0.2981 0.1779 0.0195 -0.8944 -0.2471 0.2376 0.1985 0.2839 -0.0055 -0.7122 -0.6847 0.4201 -0.6894 0.4693 -0.0687 -0.6603 1.2861 0.2733 0.2906 0.2943 0.3004 0.2866 0.1277 0.1699 0.1854 0.1693 0.1948
va: 1.1187 1.1169 0.9536 2.9785 2.7983 1.4341 1.4320 3.4860 4.3219 3.1050 3.6364 4.8106 4.1268 3.3370 2.3948 3.9269 4.4029 2.6796 2.6075 3.6167 2.6166 3.4937 4.2795 2.6886 -0.0778 4.0697 0.9329 0.9344 0.9440 0.9347 0.9784 0.9530 0.9331 0.9542 0.9353
energy: -1852.600323272022
dipole: 5.37209 -2.50546 2.86663 0.76297 -0.42533 0.33765 15.98097 -7.89303 8.08794
magnitude: 8.58757 au
magnitude: 21.82787 debye
