program: Orca
programVersion: 5.0.4
elementType: S S Cl N N O O C C C C C C C C C C N N C N C C N C C H H H H H H H H H
keywords: PBE0 aug-cc-pVDZ AutoAux D4 VeryTightSCF
charge: -4
multiplicity: 1
formula: C15H9ClN6O2S2
InChI: InChI=1/C15H9ClN6O2S2/c16-6-3-1-5(2-4-6)7(8-10(17)19-14(25)21-12(8)23)9-11(18)20-15(26)22-13(9)24/h1-4,7H,17-18H2
35 atoms
S  4.162144 -1.829043 -3.842775
S  -5.926039 0.25862 -0.631258
Cl 1.811156 0.477619 5.705252
N  0.276167 -3.672867 -1.359956
N  -1.144782 1.452344 -0.010916
O  1.560026 0.847703 -0.572508
O  -2.342403 -3.150199 -0.21474
C  -0.202013 -1.344108 0.272133
C  2.138677 -0.444974 3.1570
C  1.674316 -0.819536 1.905412
C  1.230629 -0.006304 4.104389
C  0.315273 -0.781668 1.582227
C  -0.119281 0.07249 3.820129
C  -0.560931 -0.309847 2.560589
C  -1.61941 -0.90915 -0.058952
C  -2.633987 -1.912036 -0.231917
C  -2.03751 0.409801 -0.171831
N  -3.932646 -1.522232 -0.404106
N  -3.315927 0.772034 -0.377246
C  -4.218567 -0.222523 -0.454365
N  2.01141 -2.675198 -2.500604
C  2.826557 -1.619277 -2.682057
C  1.054806 -2.539409 -1.569428
N  2.705447 -0.448646 -2.060924
C  0.851059 -1.383438 -0.824806
C  1.701978 -0.275819 -1.14767
H  0.343863 -4.281702 -2.160756
H  -0.683403 -3.515457 -1.023484
H  -0.154538 1.259577 -0.230479
H  -1.519012 2.304009 -0.398091
H  -0.361862 -2.400932 0.539811
H  3.198415 -0.474817 3.386869
H  2.372119 -1.144948 1.142423
H  -0.817629 0.43792 4.565488
H  -1.61376 -0.243487 2.308015
totalener: -2310.90987721 hartree
nucrepener: 2659.52683841 hartree
electener: -4970.43671562 hartree
oneelecener: -8555.25435869 hartree
twoeener: 3584.81764307 hartree
kineticenergy: 2303.48639763 hartree
exchangeener: -161.174198461637 hartree
correlationener: -7.404439461152 hartree
xcener: -168.578637922790 hartree
chargesum: -4.0000000
charge: -0.873579 -0.872842 -0.497561 -0.159743 -0.143319 -1.098753 -1.061626 1.212174 -0.166344 1.183118 0.072602 0.808076 -0.148418 1.318254 0.687998 0.527235 0.028569 -0.592455 -0.603157 0.064614 -0.613108 0.133885 0.052678 -0.622120 1.018044 0.522629 -0.091919 -0.087541 -0.071681 -0.100505 -0.400287 -0.726199 -0.979154 -0.738145 -0.981421
charge: -0.058625 -0.061933 0.430899 0.260674 0.274795 0.004949 -0.024274 -0.105431 -0.054293 0.060878 -0.589731 -0.108390 -0.056026 0.063284 -0.098530 -0.475335 -0.360696 -0.015747 -0.011492 -0.866771 -0.013068 -0.866022 -0.345051 -0.011219 -0.091097 -0.485770 -0.068916 -0.133576 -0.133048 -0.064075 0.016181 -0.017779 0.010775 -0.017855 0.012315
qa: -0.8736 -0.8728 -0.4976 -0.1597 -0.1433 -1.0988 -1.0616 1.2122 -0.1663 1.1831 0.0726 0.8081 -0.1484 1.3183 0.6880 0.5272 0.0286 -0.5925 -0.6032 0.0646 -0.6131 0.1339 0.0527 -0.6221 1.0180 0.5226 -0.0919 -0.0875 -0.0717 -0.1005 -0.4003 -0.7262 -0.9792 -0.7381 -0.9814
va: 0.8151 0.8055 0.3581 2.6950 2.7737 1.3389 1.2171 1.7176 2.4454 -2.5514 2.2684 5.3736 2.2981 -2.4840 2.8309 1.0034 1.1723 1.9706 2.0816 2.8921 2.1512 2.8505 -0.5688 1.9614 1.4440 1.8355 0.9936 1.0814 1.0091 0.9961 0.7863 0.4285 -0.2161 0.4278 -0.2477
energy: 2665.2 4878.4 5100.4 5282.3 6002.0 8116.8 8306.6 8518.9 9378.2 9534.6 10345.9 11628.8 11863.6 12026.3 12753.0 13107.7 13566.3 14068.5 14157.4 14215.1 15215.2 15253.3 15663.3 15983.6 16039.8 16134.1 16321.8 16402.9 16574.5 16797.2 16952.4 17092.6 17204.3 17268.6 17330.5 17423.6 17431.9 17619.5 17859.6 18212.5 18476.7 18533.9 18858.2 18930.8 19106.7 19153.0 19303.3 19604.9 19642.3 19792.0 20023.5 20246.7 20449.8 20665.1 20763.6 20829.6 20996.0 21041.2 21043.5 21138.4 21606.6 21834.1 21943.7 21977.9 22162.0 22252.1 22288.5 22322.4 22423.2 22497.2 22729.7 22900.3 22974.1 22989.7 23003.1 23319.2 23526.9 23593.4 23878.1 23902.4 24176.5 24318.5 24433.8 24536.9 24819.6 24835.3 24945.7 25094.2 25157.7 25317.0 25358.6 25480.0 25520.6 25549.7 25629.0 25664.2 25714.5 26018.8 26052.7 26076.7 26326.3 26375.9 26386.3 26596.7 26654.5 26782.6 26827.6 26922.7 26984.7 27020.8 27103.4 27142.2 27357.9 27414.7 27485.2 27673.0 27696.7 27771.9 27822.3 27919.9 28005.5 28051.6 28078.8 28094.6 28165.7 28228.1 28281.0 28334.9 28360.3 28552.8 28626.8 28898.7 28935.2 28977.6 29039.0 29091.2 29147.0 29364.6 29438.1 29549.1 29570.6 29644.0 29672.3 29755.1 29784.2 29846.4 29889.2 29977.6 30008.5 30057.8 30164.8 30189.1 30203.5 30287.9 30351.0 30411.8 30528.4 30555.3 30571.7 30612.4 30631.1 30701.1 30809.4 30867.4 30887.0 30963.4 31007.5 31076.1 31125.0 31154.6 31244.4 31276.7 31372.5 31425.4 31447.5 31484.1 31669.1 31734.8 31776.4 31877.2 31893.8 31953.3 32009.6 32056.1 32188.3 32213.7 32285.6 32433.2 32442.8 32523.2 32583.9 32667.8 32686.8 32773.8 32841.5 32885.2 32960.5 32992.3 33135.0 33248.3
energy: -2310.959114383721
dipole: -0.87017 3.83111 2.96093 -2.80271 3.48350 0.68078 -1.41752 10.02735 8.60983
magnitude: 9.13015 au
magnitude: 23.20701 debye
