program: Orca
programVersion: 5.0.4
elementType: S S Cl N N O O C C C C C C C C C C N N C N C C N C C H H H H H H H H H
keywords: PBE0 aug-cc-pVDZ AutoAux D4 VeryTightSCF
charge: -4
multiplicity: 1
formula: C15H9ClN6O2S2
InChI: InChI=1/C15H9ClN6O2S2/c16-6-3-1-5(2-4-6)7(8-10(17)19-14(25)21-12(8)23)9-11(18)20-15(26)22-13(9)24/h1-4,7H,17-18H2
35 atoms
S  3.863058 -1.544239 -4.043781
S  -5.807602 0.066084 -1.055176
Cl 1.887142 0.553291 5.718979
N  0.176408 -3.549639 -1.444833
N  -1.129361 1.379227 -0.183604
O  1.606082 0.876562 -0.407971
O  -2.319446 -3.221521 0.052255
C  -0.1759 -1.375995 0.376674
C  2.141318 -0.643756 3.305802
C  1.658772 -1.053093 2.075143
C  1.290787 0.023616 4.173178
C  0.34035 -0.813947 1.688402
C  -0.024185 0.271018 3.826892
C  -0.48755 -0.153714 2.5886
C  -1.585755 -0.975221 0.005056
C  -2.58552 -1.976312 -0.120117
C  -1.993289 0.329189 -0.271467
N  -3.860428 -1.635085 -0.439253
N  -3.2586 0.64928 -0.599914
C  -4.153568 -0.348834 -0.65907
N  1.845621 -2.49935 -2.609409
C  2.653184 -1.440524 -2.782784
C  0.951698 -2.43087 -1.609526
N  2.58371 -0.3197 -2.058588
C  0.826429 -1.330375 -0.761473
C  1.668937 -0.227367 -1.057849
H  0.197321 -4.187263 -2.224999
H  -0.718831 -3.467537 -0.962647
H  -0.118983 1.202363 -0.217394
H  -1.454464 2.232299 -0.610169
H  -0.278211 -2.441266 0.614584
H  3.169589 -0.838612 3.587272
H  2.327098 -1.568823 1.393586
H  -0.684698 0.78916 4.512254
H  -1.520772 0.035454 2.322215
elementType: S Cl N O C H
totalener: -2311.74295574 hartree
nucrepener: 2669.59952833 hartree
electener: -4981.34248406 hartree
oneelecener: -8581.28871273 hartree
twoeener: 3599.94622867 hartree
cpcmener: -0.87789949 hartree
kineticenergy: 2303.99263426 hartree
exchangeener: -161.304825603228 hartree
correlationener: -7.424499671538 hartree
xcener: -168.729325274767 hartree
chargesum: -4.0000000
charge: -0.652421 -0.655382 -0.348576 -0.220553 -0.163049 -1.221150 -1.152108 0.921495 -0.117744 1.230410 -0.048617 0.986378 -0.062439 1.353322 0.179570 0.863417 0.284331 -0.821046 -0.758528 -0.021709 -0.724571 0.026668 0.192778 -0.842652 1.097127 0.962280 -0.028623 -0.129917 -0.079792 -0.058892 -0.456533 -0.718375 -1.052023 -0.723846 -1.039229
charge: 0.054168 0.053406 0.555057 0.287172 0.291955 -0.065026 -0.091652 -0.116600 -0.026849 0.039056 -0.595568 -0.145086 -0.025118 0.041819 -0.105504 -0.515599 -0.358114 -0.064312 -0.033905 -0.931655 -0.035149 -0.930523 -0.348039 -0.059974 -0.097143 -0.511056 -0.023529 -0.132724 -0.148615 -0.022933 0.011572 0.009490 0.022493 0.009572 0.008912
qa: -0.6524 -0.6554 -0.3486 -0.2206 -0.1630 -1.2212 -1.1521 0.9215 -0.1177 1.2304 -0.0486 0.9864 -0.0624 1.3533 0.1796 0.8634 0.2843 -0.8210 -0.7585 -0.0217 -0.7246 0.0267 0.1928 -0.8427 1.0971 0.9623 -0.0286 -0.1299 -0.0798 -0.0589 -0.4565 -0.7184 -1.0520 -0.7238 -1.0392
va: 1.3526 1.3444 0.5430 2.9640 2.9567 1.2262 1.1045 2.1036 2.5083 -2.5211 2.6886 5.1438 2.4348 -1.5831 3.6882 -0.4954 0.8433 2.0022 1.9268 3.1058 2.0853 3.0697 -0.4828 1.7892 1.6893 0.2078 0.8618 1.0834 0.9670 0.8830 0.6340 0.3973 -0.3349 0.4060 -0.4768
energy: 29499.0 30493.8 31757.0 32753.4 33062.3 33667.3 33709.2 33795.4 33907.0 33938.7 34114.4 34467.8 35031.0 35141.9 35160.6 35747.5 36171.3 36333.5 36697.2 37037.7 37352.5 37390.2 37484.0 37843.4 38118.6 38166.9 38580.2 38741.2 38775.3 38903.2 39021.0 39126.8 39309.2 39408.4 39520.8 39602.7 39617.9 39807.2 40158.3 40297.1 40372.1 40437.6 40499.5 40617.5 40631.1 40767.7 41119.4 41148.2 41254.7 41321.7 41360.4 41408.4 41618.1 41709.4 41808.9 41985.9 42075.8 42130.1 42144.8 42161.7 42290.3 42352.4 42726.2 42768.0 42785.6 42930.6 42956.1 43190.3 43272.7 43295.0 43440.3 43515.6 43712.2 43888.7 43954.2 44049.1 44128.3 44202.4 44224.9 44259.8 44310.5 44330.0 44355.5 44499.7 44551.4 44674.2 44748.0 44842.9 44932.4 45013.4 45050.8 45298.4 45350.7 45426.7 45521.8 45561.6 45675.4 45789.9 45846.6 45942.4 45977.2 46016.1 46120.4 46173.0 46201.4 46265.9 46407.1 46486.0 46547.8 46588.7 46653.9 46749.6 46784.2 46812.4 46899.6 47031.1 47187.4 47206.7 47292.6 47325.0 47366.5 47415.9 47495.8 47561.1 47615.6 47662.1 47725.9 47853.1 47882.1 47980.5 47993.5 48116.6 48137.2 48215.3 48360.2 48407.7 48431.1 48648.3 48678.9 48740.5 48848.6 48921.7 48931.0 49015.6 49175.4 49204.0 49286.7 49423.9 49461.2 49491.4 49547.1 49592.8 49619.3 49651.1 49663.3 49742.1 49816.5 49841.5 49919.1 49979.5 50056.8 50088.6 50137.3 50200.1 50277.7 50338.1 50373.4 50464.7 50532.4 50608.2 50700.4 50715.7 50821.1 50855.1 50971.8 51061.0 51101.2 51153.6 51273.7 51329.7 51370.8 51398.0 51448.8 51468.2 51527.5 51550.5 51605.1 51704.8 51789.7 51846.5 51861.4 51942.5 51972.2 52043.0 52083.4 52167.4 52251.1 52281.5 52335.6 52407.0
energy: -2311.670157016653
dipole: -0.75723 4.66629 3.90906 -3.18034 4.07149 0.89115 -0.88673 12.01536 11.12863
magnitude: 11.82883 au
magnitude: 30.06651 debye
