program: Orca
programVersion: 5.0.4
elementType: S S Cl N N O O C C C C C C C C C C N N C N C C N C C H H H H H H H H H
keywords: PBE0 aug-cc-pVDZ AutoAux D4 VeryTightSCF
charge: -4
multiplicity: 1
formula: C15H9ClN6O2S2
InChI: InChI=1/C15H9ClN6O2S2/c16-6-3-1-5(2-4-6)7(8-10(17)19-14(25)21-12(8)23)9-11(18)20-15(26)22-13(9)24/h1-4,7H,17-18H2
35 atoms
S  3.935665 -1.719591 -3.994001
S  -5.830523 0.250688 -0.888115
Cl 1.849577 0.554573 5.69112
N  0.275332 -3.681923 -1.304208
N  -1.120336 1.445474 0.002015
O  1.494425 0.865486 -0.588912
O  -2.310956 -3.149767 -0.287162
C  -0.197015 -1.367306 0.333595
C  2.155366 -0.46299 3.201815
C  1.678573 -0.872196 1.96702
C  1.262692 0.028237 4.139985
C  0.324981 -0.803068 1.643727
C  -0.089133 0.10525 3.858759
C  -0.542521 -0.312948 2.616116
C  -1.59167 -0.915348 -0.04572
C  -2.586496 -1.91165 -0.295957
C  -1.992418 0.408936 -0.186764
N  -3.872658 -1.523744 -0.549097
N  -3.262891 0.765149 -0.46684
C  -4.160524 -0.221877 -0.606525
N  1.935737 -2.652147 -2.514869
C  2.697996 -1.572576 -2.753497
C  1.013901 -2.544123 -1.539367
N  2.570464 -0.405195 -2.12318
C  0.822286 -1.389298 -0.787387
C  1.622741 -0.262382 -1.147853
H  0.353816 -4.359089 -2.048127
H  -0.677771 -3.549675 -0.939204
H  -0.117213 1.25151 -0.157875
H  -1.460144 2.326727 -0.352113
H  -0.358126 -2.422982 0.584825
H  3.21299 -0.522247 3.430817
H  2.380157 -1.249468 1.232018
H  -0.783558 0.487671 4.597719
H  -1.602403 -0.253613 2.398112
elementType: S Cl N O C H
totalener: -2311.73135817 hartree
nucrepener: 2668.50594683 hartree
electener: -4980.23730500 hartree
oneelecener: -8578.50364918 hartree
twoeener: 3598.26634418 hartree
cpcmener: -0.85368351 hartree
kineticenergy: 2303.95273622 hartree
exchangeener: -161.286266352922 hartree
correlationener: -7.424236617815 hartree
xcener: -168.710502970737 hartree
chargesum: -4.0000000
charge: -0.669787 -0.671432 -0.351336 -0.229439 -0.227905 -1.151152 -1.090102 1.060535 -0.080567 1.167518 -0.059782 0.923678 -0.073431 1.270203 0.537777 0.757393 0.326856 -0.807897 -0.773990 -0.034047 -0.753997 0.024812 0.355783 -0.850075 0.772658 0.803845 -0.018794 -0.096917 -0.063247 -0.034123 -0.448898 -0.716100 -1.041024 -0.725430 -1.031584
charge: 0.029066 0.027443 0.552485 0.274183 0.282550 0.009790 -0.012153 -0.113826 -0.028413 0.041869 -0.598334 -0.137339 -0.029395 0.038567 -0.105553 -0.496153 -0.369466 -0.064809 -0.045532 -0.940457 -0.046000 -0.938464 -0.360163 -0.060974 -0.102214 -0.497855 -0.034214 -0.146528 -0.150361 -0.032816 0.013416 0.008170 0.013783 0.008562 0.011133
qa: -0.6698 -0.6714 -0.3513 -0.2294 -0.2279 -1.1512 -1.0901 1.0605 -0.0806 1.1675 -0.0598 0.9237 -0.0734 1.2702 0.5378 0.7574 0.3269 -0.8079 -0.7740 -0.0340 -0.7540 0.0248 0.3558 -0.8501 0.7727 0.8038 -0.0188 -0.0969 -0.0632 -0.0341 -0.4489 -0.7161 -1.0410 -0.7254 -1.0316
va: 1.3236 1.3142 0.5385 2.8864 2.9352 1.3019 1.2118 2.0935 2.5053 -2.5822 2.8220 5.7060 2.4803 -2.1494 3.4142 0.1684 0.5548 1.9309 1.8228 3.0658 2.0334 3.0380 -1.1265 1.7333 2.1685 0.9180 0.8687 1.1037 1.0018 0.8859 0.6578 0.3993 -0.3620 0.3994 -0.3765
energy: 28856.1 29204.9 30509.9 32018.9 32798.6 33023.5 33097.7 33257.0 33957.5 34002.4 34102.7 34209.2 34259.2 34563.8 34853.8 35342.7 35436.9 35588.0 35624.4 36118.7 36726.6 36775.6 36844.3 37127.6 37323.7 37345.4 37541.1 37697.2 38024.4 38218.6 38284.8 38430.6 38590.5 38646.8 38785.1 38911.5 39017.4 39096.6 39150.9 39256.2 39397.4 39481.7 39701.5 39744.7 39906.5 39980.7 40108.9 40204.9 40507.8 40532.9 40665.4 40747.9 40893.2 40902.9 40934.3 40949.0 41013.4 41364.8 41518.7 41581.8 41641.6 41772.1 41918.0 42056.0 42088.9 42098.2 42148.8 42274.9 42280.7 42377.0 42527.1 42599.2 42753.8 42845.7 42900.0 42982.4 42986.6 43090.4 43271.4 43299.2 43323.5 43389.9 43434.5 43541.3 43615.1 43635.9 43755.6 43771.0 43825.0 43899.7 44012.5 44067.5 44102.8 44207.7 44247.4 44366.5 44425.7 44585.1 44654.1 44718.9 44783.9 44830.2 44949.2 45006.5 45041.4 45104.5 45173.6 45244.5 45309.4 45390.6 45486.6 45512.0 45625.0 45705.2 45760.9 45826.7 45860.4 46027.3 46094.0 46115.0 46188.0 46289.4 46311.6 46370.8 46461.2 46567.0 46585.5 46673.4 46740.1 46836.3 46913.7 46924.4 46940.8 46982.4 47117.8 47184.2 47212.9 47301.1 47318.4 47359.5 47422.9 47454.7 47523.7 47581.2 47615.4 47724.0 47903.7 47953.5 47984.0 48102.3 48159.6 48221.5 48291.0 48347.2 48369.0 48492.7 48510.5 48587.8 48593.8 48674.3 48752.6 48804.0 48904.0 48937.6 48980.2 49030.3 49033.8 49129.4 49284.4 49325.7 49384.6 49450.6 49476.4 49502.8 49563.0 49670.7 49705.0 49738.7 49776.1 49846.5 49891.6 49930.0 50010.8 50044.3 50102.5 50256.3 50313.5 50360.5 50397.2 50461.8 50491.3 50562.8 50604.2 50640.4 50664.4 50843.8 50861.8 50938.6 50981.9 50991.0
energy: -2311.661472470632
dipole: -0.67595 4.63622 3.96028 -3.24029 4.03868 0.79839 -0.52795 12.05904 11.53109
magnitude: 12.21832 au
magnitude: 31.05651 debye
