program: Orca
programVersion: 5.0.4
elementType: S S Cl N N O O C C C C C C C C C C N N C N C C N C C H H H H H H H H H H H H H
keywords: PBE0 aug-cc-pVDZ AutoAux D4 VeryTightSCF
charge: 0
multiplicity: 1
formula: C15H13ClN6O2S2
InChI: InChI=1/C15H13ClN6O2S2/c16-6-3-1-5(2-4-6)7(8-10(17)19-14(25)21-12(8)23)9-11(18)20-15(26)22-13(9)24/h1-4,7,19-22H,17-18H2
39 atoms
S  4.223356 -4.015117 -2.15403
S  -5.795677 -1.565559 -1.255732
Cl 1.345393 4.432751 2.682927
N  1.188162 -0.152074 -1.833291
N  -1.978732 -3.1859 1.407761
O  0.79008 -3.677966 1.320226
O  -1.410025 0.589637 -1.423604
C  -0.145577 -1.064243 0.69157
C  1.909542 1.989235 1.693643
C  1.556574 0.739466 1.212203
C  0.917118 2.866915 2.092103
C  0.226346 0.349846 1.116732
C  -0.416033 2.4986 2.022792
C  -0.748729 1.245182 1.540278
C  -1.537372 -1.202353 0.123754
C  -2.037525 -0.309738 -0.864749
C  -2.356931 -2.228907 0.545607
N  -3.376188 -0.4707 -1.220898
N  -3.649146 -2.299947 0.093199
C  -4.224022 -1.42644 -0.782335
N  2.516386 -2.029158 -1.834729
C  2.989309 -3.229882 -1.395901
C  1.505978 -1.308579 -1.247894
N  2.341284 -3.701112 -0.307457
C  0.91451 -1.789343 -0.096979
C  1.299948 -3.075583 0.371515
H  2.974817 -1.681292 -2.662639
H  -4.259042 -3.041183 0.401483
H  1.603509 0.089396 -2.715489
H  0.287523 0.290276 -1.602921
H  -0.977559 -3.384588 1.519735
H  -2.609221 -3.942769 1.605295
H  2.630363 -4.603286 0.041058
H  -3.738049 0.183037 -1.899948
H  -0.165889 -1.611625 1.639868
H  2.949748 2.281707 1.760413
H  2.340589 0.05495 0.911486
H  -1.185405 3.18949 2.343082
H  -1.794447 0.964827 1.494226
totalener: -2313.63622225 hartree
nucrepener: 2782.48806445 hartree
electener: -5096.12428670 hartree
oneelecener: -8709.35481347 hartree
twoeener: 3613.23052677 hartree
kineticenergy: 2306.27591031 hartree
exchangeener: -161.786263978475 hartree
correlationener: -7.444214695461 hartree
xcener: -169.230478673937 hartree
chargesum: -0.0000000
charge: -0.199747 -0.195861 -0.314481 -0.025535 -0.054495 -0.898107 -0.942815 1.176033 -0.067578 1.249993 -0.116181 0.940156 -0.101471 1.158094 1.446535 0.146790 0.280305 -0.357676 -0.415398 0.455734 -0.274372 0.446332 -0.566731 -0.449111 1.315292 0.731783 -0.099463 -0.061151 -0.123937 0.056882 -0.018367 -0.092706 -0.027505 -0.054844 -0.524932 -0.717591 -0.987448 -0.702448 -1.013977
charge: 0.576631 0.577600 0.603174 0.362293 0.355371 0.119131 0.137283 -0.085224 -0.009124 0.050973 -0.581786 -0.133607 -0.006287 0.052739 -0.051098 -0.331872 -0.192204 0.150142 0.145269 -0.732896 0.146451 -0.732237 -0.204209 0.149298 -0.055243 -0.327595 0.025532 0.025841 0.005562 -0.098834 -0.099415 0.001650 0.035296 0.035274 0.038168 0.007532 0.014549 0.008347 0.017528
qa: -0.1997 -0.1959 -0.3145 -0.0255 -0.0545 -0.8981 -0.9428 1.1760 -0.0676 1.2500 -0.1162 0.9402 -0.1015 1.1581 1.4465 0.1468 0.2803 -0.3577 -0.4154 0.4557 -0.2744 0.4463 -0.5667 -0.4491 1.3153 0.7318 -0.0995 -0.0612 -0.1239 0.0569 -0.0184 -0.0927 -0.0275 -0.0548 -0.5249 -0.7176 -0.9874 -0.7024 -1.0140
va: 1.8133 1.8174 0.5721 2.9710 3.0075 1.3954 1.4762 0.3564 2.2602 -2.6110 2.8013 5.3045 2.2934 -3.1109 1.2309 2.4078 -1.7540 2.6835 2.6843 3.0624 2.5677 3.0494 0.8718 2.7714 1.6703 -0.3151 0.8810 0.8741 0.8723 0.8715 0.9943 0.8551 0.8853 0.8902 0.6750 0.4266 -0.3157 0.4400 -0.3427
energy: 31890.7 31953.3 34978.2 35472.4 37467.2 37901.4 38340.2 38765.0 38884.2 38961.2 39528.7 40249.7 40601.4 40615.5 40726.5 41014.8 41126.6 41202.9 41341.2 41621.6 41873.0 42467.8 42857.0 42926.8 43034.0 43234.3 43763.9 43873.8 43932.6 44572.7 44844.8 45344.7 45366.2 45504.2 45707.5 45899.0 45937.3 46258.5 46315.8 46382.3 46559.4 46648.3 46771.4 46871.4 46887.3 46936.8 47005.2 47140.6 47292.1 47410.5 47501.6 47758.3 47917.3 48189.9 48425.9 48501.5 48557.6 49059.8 49113.1 49179.4 49348.6 49471.7 49579.0 49698.3 49848.0 50003.1 50375.2 50477.9 50504.2 50885.0 51104.3 51131.7 51341.5 51464.5 51549.4 51917.7 52078.5 52289.7 52501.2 52548.9 52582.8 52657.4 52759.5 52789.3 52843.2 52974.2 53029.6 53171.2 53243.8 53290.7 53491.2 53770.7 53784.0 53972.6 54006.1 54027.8 54106.4 54270.5 54386.2 54411.2 54498.7 54711.2 54770.5 54802.3 54803.8 55004.8 55072.3 55122.8 55237.4 55301.1 55424.8 55462.6 55513.9 55830.6 56042.3 56117.5 56287.5 56466.0 56651.1 56701.7 56735.1 56821.7 56879.1 57012.1 57055.1 57070.3 57178.0 57227.7 57259.3 57304.9 57375.9 57456.5 57541.6 57579.7 57642.2 57814.5 57872.7 57936.9 57979.5 58086.9 58176.5 58222.1 58252.7 58283.9 58310.3 58452.0 58665.9 58727.3 58799.1 58816.4 58829.8 58917.4 58925.4 58934.1 58961.8 59086.6 59127.4 59251.0 59334.9 59383.8 59530.7 59553.0 59622.1 59666.4 59696.1 59740.5 59898.7 59965.9 60086.8 60141.7 60277.6 60361.0 60403.6 60458.5 60487.2 60597.5 60671.4 60707.4 60752.0 60833.5 60892.9 60996.6 61061.6 61073.3 61226.7 61347.7 61418.2 61528.5 61587.9 61640.0 61721.2 61844.8 61863.3 61927.8 62024.1 62053.0 62236.6 62296.4 62405.0 62458.5
energy: -2313.550359066438
dipole: -2.07399 1.85969 -0.21431 -7.92615 7.46588 -0.46027 -1.38410 1.34768 -0.03642
magnitude: 0.50902 au
magnitude: 1.29382 debye
