program: Orca
programVersion: 5.0.4
elementType: S S Cl N N O O C C C C C C C C C C N N C N C C N C C H H H H H H H H H
keywords: PBE0 aug-cc-pVDZ AutoAux D4 VeryTightSCF
charge: -4
multiplicity: 1
formula: C15H9ClN6O2S2
InChI: InChI=1/C15H9ClN6O2S2/c16-6-3-1-5(2-4-6)7(8-10(17)19-14(25)21-12(8)23)9-11(18)20-15(26)22-13(9)24/h1-4,7H,17-18H2
35 atoms
S  3.84381 -1.515933 -4.058036
S  -5.797321 0.040439 -1.053499
Cl 1.873577 0.557755 5.726944
N  0.148799 -3.519516 -1.472957
N  -1.113979 1.357939 -0.232261
O  1.631653 0.872373 -0.374527
O  -2.315336 -3.231142 0.117169
C  -0.16682 -1.380388 0.383162
C  2.132787 -0.660028 3.326243
C  1.655427 -1.07181 2.094712
C  1.283542 0.025294 4.181145
C  0.343501 -0.817599 1.695985
C  -0.024899 0.287994 3.822174
C  -0.483633 -0.139919 2.583165
C  -1.578426 -0.987895 0.012297
C  -2.580523 -1.987471 -0.083796
C  -1.982699 0.311045 -0.289351
N  -3.85673 -1.652017 -0.404938
N  -3.248416 0.6286 -0.620285
C  -4.146182 -0.369088 -0.653486
N  1.822139 -2.470613 -2.633905
C  2.643564 -1.419072 -2.791531
C  0.937448 -2.408481 -1.625217
N  2.593226 -0.309639 -2.046647
C  0.832515 -1.322975 -0.756785
C  1.683593 -0.225128 -1.040343
H  0.145224 -4.139886 -2.266341
H  -0.731037 -3.436292 -0.966248
H  -0.104763 1.17712 -0.237003
H  -1.432651 2.203038 -0.677169
H  -0.259589 -2.446716 0.617566
H  3.155183 -0.866141 3.61937
H  2.321783 -1.600612 1.42155
H  -0.682857 0.820176 4.498574
H  -1.511571 0.06109 2.305136
elementType: S Cl N O C H
totalener: -2311.75814807 hartree
nucrepener: 2671.24801725 hartree
electener: -4983.00616532 hartree
oneelecener: -8584.73346060 hartree
twoeener: 3601.72729529 hartree
cpcmener: -0.89676032 hartree
kineticenergy: 2304.01217733 hartree
exchangeener: -161.308619267268 hartree
correlationener: -7.425177537389 hartree
xcener: -168.733796804658 hartree
chargesum: -4.0000000
charge: -0.648947 -0.652434 -0.344656 -0.218802 -0.152143 -1.224086 -1.155020 0.855311 -0.121728 1.205397 -0.049489 1.057247 -0.054828 1.374092 0.152131 0.861041 0.278979 -0.827410 -0.758321 -0.026004 -0.727112 0.028117 0.149289 -0.848881 1.171860 0.986581 -0.028540 -0.132467 -0.072820 -0.068283 -0.466117 -0.718494 -1.056862 -0.724415 -1.042185
charge: 0.060064 0.059395 0.558753 0.289570 0.294261 -0.069196 -0.097815 -0.117853 -0.025940 0.038670 -0.595982 -0.146712 -0.023988 0.041774 -0.107954 -0.517433 -0.358021 -0.065489 -0.033734 -0.934642 -0.034951 -0.933061 -0.347725 -0.060877 -0.097656 -0.511819 -0.022087 -0.131332 -0.149417 -0.021620 0.011116 0.009887 0.023189 0.009978 0.008645
qa: -0.6489 -0.6524 -0.3447 -0.2188 -0.1521 -1.2241 -1.1550 0.8553 -0.1217 1.2054 -0.0495 1.0572 -0.0548 1.3741 0.1521 0.8610 0.2790 -0.8274 -0.7583 -0.0260 -0.7271 0.0281 0.1493 -0.8489 1.1719 0.9866 -0.0285 -0.1325 -0.0728 -0.0683 -0.4661 -0.7185 -1.0569 -0.7244 -1.0422
va: 1.3621 1.3548 0.5481 2.9751 2.9638 1.2226 1.0997 2.1143 2.5346 -2.3998 2.6817 4.9013 2.4097 -1.6137 3.6956 -0.5009 0.8523 2.0050 1.9322 3.1199 2.0887 3.0794 -0.4310 1.8026 1.5772 0.1540 0.8626 1.0857 0.9520 0.8839 0.6223 0.3952 -0.3333 0.4058 -0.4903
energy: 29841.1 30895.0 32021.3 33009.9 33322.0 33907.3 33954.3 34084.7 34170.2 34188.8 34281.9 34560.0 35149.8 35383.7 35644.3 35989.5 36542.4 36636.1 36932.8 37315.7 37575.0 37764.4 37828.2 38049.1 38489.6 38666.7 38875.6 39037.9 39069.7 39323.9 39427.7 39500.6 39561.7 39622.1 39666.2 39806.1 39814.0 40228.3 40480.9 40522.2 40642.0 40727.6 40790.2 40851.1 41006.4 41138.1 41427.3 41528.3 41589.4 41766.1 41821.5 41850.0 41877.2 41942.2 42135.2 42264.7 42350.7 42374.6 42404.7 42457.5 42507.9 42683.7 43081.6 43137.4 43226.3 43231.1 43292.3 43533.2 43578.6 43632.8 43768.2 43825.9 44056.0 44173.2 44281.0 44310.9 44350.8 44409.5 44480.3 44580.2 44607.8 44645.1 44739.6 44803.8 44840.2 44923.4 45092.2 45160.4 45193.4 45331.8 45450.6 45619.0 45657.6 45745.3 45823.2 45956.5 46049.7 46160.7 46217.0 46300.0 46333.6 46402.2 46488.5 46517.0 46601.0 46649.0 46722.3 46769.2 46877.0 46921.2 47050.4 47091.7 47119.7 47152.9 47273.6 47419.6 47441.5 47531.4 47574.1 47655.1 47701.7 47732.9 47772.3 47879.0 47959.1 47988.3 48062.6 48096.0 48193.3 48261.0 48305.3 48395.8 48405.8 48498.5 48620.6 48700.3 48725.2 48856.5 48903.3 49047.0 49115.4 49182.0 49286.1 49358.5 49455.1 49506.8 49642.4 49781.9 49864.7 49870.9 49909.8 49931.0 49938.7 49963.7 50012.0 50048.6 50166.8 50228.9 50295.8 50329.5 50378.7 50423.0 50488.8 50570.3 50608.2 50676.5 50760.1 50879.0 50884.9 50924.5 51008.2 51072.1 51137.2 51218.5 51343.8 51403.2 51435.4 51483.2 51586.5 51629.8 51742.1 51791.3 51840.5 51878.2 51887.6 51945.6 51997.1 52012.7 52067.0 52185.4 52214.7 52242.8 52325.7 52429.5 52443.4 52490.1 52528.4 52624.3 52684.7 52754.7
energy: -2311.683870495579
dipole: -0.75203 4.66594 3.91392 -3.17061 4.09652 0.92591 -1.01142 12.09455 11.08313
magnitude: 11.79033 au
magnitude: 29.96862 debye
