program: Orca
programVersion: 5.0.4
elementType: S S Cl N N O O C C C C C C C C C C N N C N C C N C C H H H H H H H H H H H H H
keywords: PBE0 ma-def2-TZVP AutoAux D4 VeryTightSCF TightOPT MORead
charge: 0
multiplicity: 1
formula: C15H13ClN6O2S2
InChI: InChI=1/C15H13ClN6O2S2/c16-6-3-1-5(2-4-6)7(8-10(17)19-14(25)21-12(8)23)9-11(18)20-15(26)22-13(9)24/h1-4,7,19-22H,17-18H2
39 atoms
S  4.213357 -4.078029 -2.115134
S  -5.772321 -1.519066 -1.335159
Cl 1.312177 4.448956 2.694988
N  1.134526 -0.243721 -1.876601
N  -1.971897 -3.206984 1.306527
O  0.880372 -3.621834 1.447882
O  -1.411276 0.697317 -1.347985
C  -0.141657 -1.059227 0.696369
C  1.891566 2.046691 1.607564
C  1.549131 0.790701 1.127383
C  0.898067 2.871032 2.102118
C  0.231531 0.351014 1.129719
C  -0.422872 2.454255 2.134601
C  -0.743138 1.198065 1.650252
C  -1.524685 -1.176521 0.100476
C  -2.028902 -0.243547 -0.837913
C  -2.3431 -2.226532 0.481732
N  -3.363609 -0.406839 -1.213742
N  -3.630125 -2.290293 0.015582
C  -4.189716 -1.39094 -0.823262
N  2.483986 -2.096024 -1.838092
C  2.974606 -3.258242 -1.355495
C  1.479892 -1.365416 -1.25399
N  2.378488 -3.694095 -0.232375
C  0.923742 -1.804084 -0.064746
C  1.346411 -3.053718 0.452921
H  2.896112 -1.756018 -2.698157
H  -4.214601 -3.065978 0.299685
H  1.532814 -0.029904 -2.777844
H  0.264751 0.233452 -1.615762
H  -0.981059 -3.369543 1.489606
H  -2.606549 -3.970071 1.488343
H  2.695217 -4.575225 0.150962
H  -3.73035 0.273306 -1.866771
H  -0.193436 -1.597626 1.648788
H  2.923504 2.375819 1.593694
H  2.336163 0.147075 0.753788
H  -1.193814 3.102974 2.532512
H  -1.778336 0.876791 1.679901
totalener: -2313.95383861 hartree
nucrepener: 2781.23276414 hartree
electener: -5095.18660275 hartree
oneelecener: -8707.14394113 hartree
twoeener: 3611.95733839 hartree
cpcmener: -0.06015204 hartree
kineticenergy: 2307.45231745 hartree
exchangeener: -161.832319971033 hartree
correlationener: -7.429417916160 hartree
xcener: -169.261737887193 hartree
elementType: S Cl N O C H
chargesum: -0.0000000
charge: -0.567825 -0.566549 -0.199992 -0.491937 -0.594670 -0.591905 -0.519170 -0.917088 0.233621 -0.229592 -0.187605 -0.240247 0.057378 -0.131662 0.904440 0.351293 0.195983 -0.184430 -0.163118 0.181671 -0.172153 0.168836 0.303848 -0.212482 -0.147450 0.196733 0.323275 0.321768 0.325248 0.320439 0.313015 0.328695 0.316804 0.318702 0.163283 0.194021 0.204040 0.195001 0.199777
charge: 0.135872 0.136692 0.370402 0.017606 0.008462 -0.064908 -0.043377 -0.151366 -0.170156 -0.122710 -0.458821 -0.148526 -0.170259 -0.111696 -0.133633 -0.384325 -0.257332 0.127331 0.131129 -0.613978 0.129527 -0.613489 -0.268380 0.126350 -0.138120 -0.382104 0.268670 0.268209 0.231288 0.228947 0.223548 0.230697 0.266129 0.266699 0.245654 0.198043 0.212156 0.198156 0.211616
qa: -0.5678 -0.5665 -0.2000 -0.4919 -0.5947 -0.5919 -0.5192 -0.9171 0.2336 -0.2296 -0.1876 -0.2402 0.0574 -0.1317 0.9044 0.3513 0.1960 -0.1844 -0.1631 0.1817 -0.1722 0.1688 0.3038 -0.2125 -0.1474 0.1967 0.3233 0.3218 0.3252 0.3204 0.3130 0.3287 0.3168 0.3187 0.1633 0.1940 0.2040 0.1950 0.1998
va: 1.6449 1.6473 0.9987 2.9153 3.0965 1.8101 1.7887 3.3469 3.2087 4.2312 4.1176 5.2973 3.8107 4.1985 0.5943 4.1593 4.1847 3.2164 3.1950 4.0225 3.2145 4.0646 4.0717 3.2271 3.6361 4.1403 0.9040 0.9036 0.9095 0.9526 0.9434 0.9086 0.9084 0.9059 0.9553 0.9422 0.9339 0.9414 0.9284
energy: -2314.013259372528
dipole: -2.15491 1.78082 -0.37410 -8.13602 7.30774 -0.82829 -1.58981 1.58163 -0.00818
magnitude: 0.90888 au
magnitude: 2.31020 debye
