program: Orca
programVersion: 5.0.4
elementType: S S Cl N N O O C C C C C C C C C C N N C N C C N C C H H H H H H H H H
keywords: PBE0 ma-def2-TZVP AutoAux D4 VeryTightSCF TightOPT MORead
charge: -4
multiplicity: 1
formula: C15H9ClN6O2S2
InChI: InChI=1/C15H9ClN6O2S2/c16-6-3-1-5(2-4-6)7(8-10(17)19-14(25)21-12(8)23)9-11(18)20-15(26)22-13(9)24/h1-4,7H,17-18H2
35 atoms
S  3.84381 -1.515933 -4.058036
S  -5.797321 0.040439 -1.053499
Cl 1.873577 0.557755 5.726944
N  0.148799 -3.519516 -1.472957
N  -1.113979 1.357939 -0.232261
O  1.631653 0.872373 -0.374527
O  -2.315336 -3.231142 0.117169
C  -0.16682 -1.380388 0.383162
C  2.132787 -0.660028 3.326243
C  1.655427 -1.07181 2.094712
C  1.283542 0.025294 4.181145
C  0.343501 -0.817599 1.695985
C  -0.024899 0.287994 3.822174
C  -0.483633 -0.139919 2.583165
C  -1.578426 -0.987895 0.012297
C  -2.580523 -1.987471 -0.083796
C  -1.982699 0.311045 -0.289351
N  -3.85673 -1.652017 -0.404938
N  -3.248416 0.6286 -0.620285
C  -4.146182 -0.369088 -0.653486
N  1.822139 -2.470613 -2.633905
C  2.643564 -1.419072 -2.791531
C  0.937448 -2.408481 -1.625217
N  2.593226 -0.309639 -2.046647
C  0.832515 -1.322975 -0.756785
C  1.683593 -0.225128 -1.040343
H  0.145224 -4.139886 -2.266341
H  -0.731037 -3.436292 -0.966248
H  -0.104763 1.17712 -0.237003
H  -1.432651 2.203038 -0.677169
H  -0.259589 -2.446716 0.617566
H  3.155183 -0.866141 3.61937
H  2.321783 -1.600612 1.42155
H  -0.682857 0.820176 4.498574
H  -1.511571 0.06109 2.305136
totalener: -2312.01022021 hartree
nucrepener: 2671.28129094 hartree
electener: -4983.29151115 hartree
oneelecener: -8586.32916578 hartree
twoeener: 3603.03765463 hartree
cpcmener: -0.89760915 hartree
kineticenergy: 2305.40005303 hartree
exchangeener: -161.375294499074 hartree
correlationener: -7.412053017181 hartree
xcener: -168.787347516255 hartree
elementType: S Cl N O C H
chargesum: -4.0000000
charge: -0.924482 -0.927900 -0.210906 -0.677773 -0.596401 -0.826195 -0.886303 -0.655344 0.021476 0.090148 -0.135536 -0.786378 0.126828 0.104152 0.328164 0.251542 0.002466 -0.710357 -0.681192 0.423155 -0.687729 0.464814 -0.064629 -0.661812 1.244430 0.299267 0.290954 0.294399 0.301209 0.287320 0.131581 0.191515 0.190228 0.189118 0.200173
charge: -0.197900 -0.198523 0.358129 -0.103755 -0.090544 -0.261930 -0.294591 -0.180805 -0.182193 -0.124835 -0.467015 -0.153481 -0.180837 -0.134060 -0.179415 -0.459805 -0.357586 -0.085302 -0.077739 -0.689471 -0.077247 -0.688654 -0.347708 -0.078783 -0.173413 -0.459258 0.210088 0.207420 0.212114 0.210469 0.236789 0.195810 0.208156 0.195681 0.210196
qa: -0.9245 -0.9279 -0.2109 -0.6778 -0.5964 -0.8262 -0.8863 -0.6553 0.0215 0.0901 -0.1355 -0.7864 0.1268 0.1042 0.3282 0.2515 0.0025 -0.7104 -0.6812 0.4232 -0.6877 0.4648 -0.0646 -0.6618 1.2444 0.2993 0.2910 0.2944 0.3012 0.2873 0.1316 0.1915 0.1902 0.1891 0.2002
va: 1.1206 1.1199 0.9843 2.9802 2.7960 1.4392 1.4301 3.5185 3.8861 3.5731 4.0561 5.3029 3.3620 3.9105 2.2493 3.9715 4.3971 2.6768 2.6075 3.6146 2.6103 3.5030 4.2701 2.6902 0.1473 4.0234 0.9329 0.9347 0.9436 0.9346 0.9766 0.9415 0.9317 0.9442 0.9331
energy: -2312.071910293069
dipole: -0.75203 4.66006 3.90803 -3.17061 4.11087 0.94026 -1.01142 12.06592 11.05450
magnitude: 11.76260 au
magnitude: 29.89816 debye
