program: Orca
programVersion: 5.0.4
elementType: S S Cl N N O O C C C C C C C C C C N N C N C C N C C H H H H H H H H H H H H H
keywords: PBE0 ma-def2-TZVP AutoAux D4 VeryTightSCF TightOPT MORead
charge: 0
multiplicity: 1
formula: C15H13ClN6O2S2
InChI: InChI=1/C15H13ClN6O2S2/c16-6-3-1-5(2-4-6)7(8-10(17)19-14(25)21-12(8)23)9-11(18)20-15(26)22-13(9)24/h1-4,7,19-22H,17-18H2
39 atoms
S  4.223356 -4.015117 -2.15403
S  -5.795677 -1.565559 -1.255732
Cl 1.345393 4.432751 2.682927
N  1.188162 -0.152074 -1.833291
N  -1.978732 -3.1859 1.407761
O  0.79008 -3.677966 1.320226
O  -1.410025 0.589637 -1.423604
C  -0.145577 -1.064243 0.69157
C  1.909542 1.989235 1.693643
C  1.556574 0.739466 1.212203
C  0.917118 2.866915 2.092103
C  0.226346 0.349846 1.116732
C  -0.416033 2.4986 2.022792
C  -0.748729 1.245182 1.540278
C  -1.537372 -1.202353 0.123754
C  -2.037525 -0.309738 -0.864749
C  -2.356931 -2.228907 0.545607
N  -3.376188 -0.4707 -1.220898
N  -3.649146 -2.299947 0.093199
C  -4.224022 -1.42644 -0.782335
N  2.516386 -2.029158 -1.834729
C  2.989309 -3.229882 -1.395901
C  1.505978 -1.308579 -1.247894
N  2.341284 -3.701112 -0.307457
C  0.91451 -1.789343 -0.096979
C  1.299948 -3.075583 0.371515
H  2.974817 -1.681292 -2.662639
H  -4.259042 -3.041183 0.401483
H  1.603509 0.089396 -2.715489
H  0.287523 0.290276 -1.602921
H  -0.977559 -3.384588 1.519735
H  -2.609221 -3.942769 1.605295
H  2.630363 -4.603286 0.041058
H  -3.738049 0.183037 -1.899948
H  -0.165889 -1.611625 1.639868
H  2.949748 2.281707 1.760413
H  2.340589 0.05495 0.911486
H  -1.185405 3.18949 2.343082
H  -1.794447 0.964827 1.494226
totalener: -2313.89847977 hartree
nucrepener: 2782.43133116 hartree
electener: -5096.32981093 hartree
oneelecener: -8710.77610736 hartree
twoeener: 3614.44629643 hartree
kineticenergy: 2307.57690296 hartree
exchangeener: -161.852586240220 hartree
correlationener: -7.431646806082 hartree
xcener: -169.284233046303 hartree
chargesum: 0.0000000
charge: -0.417772 -0.415778 -0.177230 -0.396267 -0.483764 -0.537450 -0.449029 -1.356296 0.205068 -0.214359 -0.173351 0.263135 0.098912 -0.317657 0.421477 0.342414 0.359469 -0.161769 -0.162488 0.070372 -0.167708 0.056780 0.200547 -0.173180 0.390908 0.254307 0.250413 0.247240 0.243280 0.330169 0.324594 0.245639 0.271698 0.274648 0.154380 0.150195 0.149722 0.150849 0.147882
charge: 0.246461 0.247655 0.398916 0.003516 -0.014779 -0.041290 -0.015902 -0.151949 -0.163720 -0.119097 -0.451176 -0.149712 -0.160391 -0.110553 -0.137344 -0.387679 -0.269938 0.118607 0.104062 -0.633523 0.103646 -0.632840 -0.280371 0.118871 -0.140883 -0.382736 0.246508 0.245895 0.207652 0.232321 0.224821 0.205255 0.254935 0.255837 0.242588 0.189707 0.203364 0.190102 0.203165
qa: -0.4178 -0.4158 -0.1772 -0.3963 -0.4838 -0.5375 -0.4490 -1.3563 0.2051 -0.2144 -0.1734 0.2631 0.0989 -0.3177 0.4215 0.3424 0.3595 -0.1618 -0.1625 0.0704 -0.1677 0.0568 0.2005 -0.1732 0.3909 0.2543 0.2504 0.2472 0.2433 0.3302 0.3246 0.2456 0.2717 0.2746 0.1544 0.1502 0.1497 0.1508 0.1479
va: 1.8580 1.8610 1.0260 2.8962 3.0613 1.9055 1.8711 3.1548 3.3400 3.9554 4.1227 4.7077 3.6149 4.4774 1.4701 4.1433 3.8728 3.1622 3.0783 4.2394 3.1031 4.2734 4.2547 3.1437 2.7134 4.0302 0.9565 0.9573 0.9524 0.9693 0.9566 0.9537 0.9416 0.9390 0.9471 0.9532 0.9475 0.9526 0.9418
energy: -2313.957917811552
dipole: -2.07399 1.85103 -0.22297 -7.92615 7.45013 -0.47602 -1.38410 1.32059 -0.06351
magnitude: 0.52948 au
magnitude: 1.34582 debye
