program: Orca
programVersion: 5.0.4
elementType: S S Cl N N O O C C C C C C C C C C N N C N C C N C C H H H H H H H H H
keywords: PBE0 ma-def2-TZVP AutoAux D4 VeryTightSCF TightOPT MORead
charge: -4
multiplicity: 1
formula: C15H9ClN6O2S2
InChI: InChI=1/C15H9ClN6O2S2/c16-6-3-1-5(2-4-6)7(8-10(17)19-14(25)21-12(8)23)9-11(18)20-15(26)22-13(9)24/h1-4,7H,17-18H2
35 atoms
S  3.863058 -1.544239 -4.043781
S  -5.807602 0.066084 -1.055176
Cl 1.887142 0.553291 5.718979
N  0.176408 -3.549639 -1.444833
N  -1.129361 1.379227 -0.183604
O  1.606082 0.876562 -0.407971
O  -2.319446 -3.221521 0.052255
C  -0.1759 -1.375995 0.376674
C  2.141318 -0.643756 3.305802
C  1.658772 -1.053093 2.075143
C  1.290787 0.023616 4.173178
C  0.34035 -0.813947 1.688402
C  -0.024185 0.271018 3.826892
C  -0.48755 -0.153714 2.5886
C  -1.585755 -0.975221 0.005056
C  -2.58552 -1.976312 -0.120117
C  -1.993289 0.329189 -0.271467
N  -3.860428 -1.635085 -0.439253
N  -3.2586 0.64928 -0.599914
C  -4.153568 -0.348834 -0.65907
N  1.845621 -2.49935 -2.609409
C  2.653184 -1.440524 -2.782784
C  0.951698 -2.43087 -1.609526
N  2.58371 -0.3197 -2.058588
C  0.826429 -1.330375 -0.761473
C  1.668937 -0.227367 -1.057849
H  0.197321 -4.187263 -2.224999
H  -0.718831 -3.467537 -0.962647
H  -0.118983 1.202363 -0.217394
H  -1.454464 2.232299 -0.610169
H  -0.278211 -2.441266 0.614584
H  3.169589 -0.838612 3.587272
H  2.327098 -1.568823 1.393586
H  -0.684698 0.78916 4.512254
H  -1.520772 0.035454 2.322215
totalener: -2311.99492418 hartree
nucrepener: 2669.94133141 hartree
electener: -4981.93625559 hartree
oneelecener: -8583.50682557 hartree
twoeener: 3601.57056998 hartree
cpcmener: -0.87894044 hartree
kineticenergy: 2305.38098021 hartree
exchangeener: -161.371708757011 hartree
correlationener: -7.411393003015 hartree
xcener: -168.783101760026 hartree
elementType: S Cl N O C H
chargesum: -4.0000000
charge: -0.929988 -0.933646 -0.214434 -0.678046 -0.583114 -0.821323 -0.881246 -0.724866 0.026158 0.055753 -0.148210 -0.685993 0.147920 0.058906 0.194647 0.266487 0.023541 -0.707591 -0.679596 0.415533 -0.683031 0.464179 -0.036435 -0.654430 1.357422 0.284171 0.288163 0.298223 0.302597 0.284322 0.127217 0.189331 0.190824 0.187238 0.199317
charge: -0.203260 -0.203950 0.354713 -0.106821 -0.093781 -0.256884 -0.288557 -0.179602 -0.183250 -0.124448 -0.466682 -0.152079 -0.182074 -0.133236 -0.177571 -0.459684 -0.357527 -0.083236 -0.077253 -0.687731 -0.077111 -0.687256 -0.348402 -0.077230 -0.172322 -0.459415 0.209384 0.207191 0.212008 0.209858 0.237154 0.195345 0.208342 0.195240 0.210127
qa: -0.9300 -0.9336 -0.2144 -0.6780 -0.5831 -0.8213 -0.8812 -0.7249 0.0262 0.0558 -0.1482 -0.6860 0.1479 0.0589 0.1946 0.2665 0.0235 -0.7076 -0.6796 0.4155 -0.6830 0.4642 -0.0364 -0.6544 1.3574 0.2842 0.2882 0.2982 0.3026 0.2843 0.1272 0.1893 0.1908 0.1872 0.1993
va: 1.1097 1.1083 0.9793 2.9655 2.7814 1.4476 1.4356 3.3945 3.8686 3.6725 4.0636 5.3222 3.3208 3.9604 2.4951 3.9518 4.3700 2.6830 2.6075 3.6310 2.6115 3.5018 4.2225 2.6909 -0.4306 4.0550 0.9347 0.9328 0.9437 0.9364 0.9795 0.9422 0.9312 0.9445 0.9338
energy: -2312.056541618610
dipole: -0.75723 4.66090 3.90367 -3.18034 4.08544 0.90510 -0.88673 11.98761 11.10088
magnitude: 11.80200 au
magnitude: 29.99831 debye
