program: Orca
programVersion: 5.0.4
elementType: S S Cl N N O O C C C C C C C C C C N N C N C C N C C H H H H H H H H H H H H H H H
keywords: PBE0 ma-def2-TZVP AutoAux D4 VeryTightSCF TightOPT MORead
charge: 2
multiplicity: 1
formula: C15H15ClN6O2S2
InChI: InChI=1/C15H15ClN6O2S2/c16-6-3-1-5(2-4-6)7(8-10(17)19-14(25)21-12(8)23)9-11(18)20-15(26)22-13(9)24/h1-4,7,19-24H,17-18H2
41 atoms
S  3.432291 -2.215139 -4.36844
S  -5.530484 1.19212 -1.228673
Cl 1.67155 0.187214 5.657124
N  1.530619 -3.592598 -0.032433
N  -0.942453 1.459085 0.579723
O  0.446049 0.67448 -1.897717
O  -2.602401 -2.658203 -1.195584
C  -0.324863 -1.427838 0.217819
C  1.908861 -0.026618 2.994266
C  1.454543 -0.404316 1.739152
C  1.121962 -0.2724 4.112219
C  0.214436 -1.018567 1.584619
C  -0.113353 -0.902004 3.974484
C  -0.559021 -1.267408 2.719046
C  -1.615136 -0.720367 -0.167344
C  -2.641479 -1.407524 -0.812237
C  -1.888437 0.629957 0.093426
N  -3.80517 -0.820418 -1.118707
N  -3.076386 1.162557 -0.23612
C  -4.12736 0.498921 -0.858961
N  2.35212 -2.813734 -2.027073
C  2.501349 -1.92834 -3.086556
C  1.544271 -2.642107 -0.964502
N  1.789417 -0.764267 -2.87658
C  0.722319 -1.49604 -0.877921
C  0.963008 -0.527414 -1.843462
H  2.12919 -4.401344 -0.103703
H  -1.761037 -3.089167 -1.003876
H  0.062765 0.986653 -1.057329
H  -1.1944 2.410789 0.809862
H  -0.63739 -2.471807 0.368019
H  2.874038 0.450448 3.110043
H  2.087971 -0.218112 0.87778
H  -0.713137 -1.102999 4.853383
H  -1.524847 -1.755211 2.626395
H  1.926985 -0.02743 -3.559673
H  2.939398 -3.635808 -2.102103
H  -3.278059 2.134696 -0.033578
H  -4.518138 -1.371463 -1.585692
H  -0.245164 1.041711 1.193912
H  1.176936 -3.389188 0.889093
totalener: -2314.49065417 hartree
nucrepener: 2836.04312071 hartree
electener: -5150.53377489 hartree
oneelecener: -8766.51110178 hartree
twoeener: 3615.97732690 hartree
kineticenergy: 2308.15721519 hartree
exchangeener: -161.986971414897 hartree
correlationener: -7.435576251969 hartree
xcener: -169.422547666866 hartree
chargesum: 2.0000000
charge: -0.151450 -0.142771 -0.041584 -0.443076 -0.418058 -0.226500 -0.233337 1.459060 -0.257112 0.614997 0.177987 -0.832554 -0.044707 0.115180 -1.649075 0.151565 0.573393 -0.165846 -0.160635 -0.034911 -0.131518 -0.037268 0.362071 -0.153406 -1.062314 0.575974 0.302177 0.363310 0.390569 0.302184 0.183237 0.196487 0.185507 0.198484 0.175737 0.311238 0.285646 0.286129 0.312830 0.342626 0.319733
charge: 0.481032 0.493584 0.511176 0.042307 0.007972 0.136453 0.157761 -0.182450 -0.133935 -0.158212 -0.442098 -0.230492 -0.122681 -0.127218 -0.133721 -0.271908 -0.261952 0.164593 0.143981 -0.622717 0.138830 -0.626078 -0.252096 0.157135 -0.141359 -0.288167 0.229963 0.248780 0.245125 0.231129 0.228474 0.203847 0.208379 0.204594 0.205372 0.274492 0.263368 0.264757 0.276537 0.241791 0.233652
qa: -0.1514 -0.1428 -0.0416 -0.4431 -0.4181 -0.2265 -0.2333 1.4591 -0.2571 0.6150 0.1780 -0.8326 -0.0447 0.1152 -1.6491 0.1516 0.5734 -0.1658 -0.1606 -0.0349 -0.1315 -0.0373 0.3621 -0.1534 -1.0623 0.5760 0.3022 0.3633 0.3906 0.3022 0.1832 0.1965 0.1855 0.1985 0.1757 0.3112 0.2856 0.2861 0.3128 0.3426 0.3197
va: 2.1369 2.1504 1.2156 3.1547 2.9974 2.2760 2.2989 -1.2027 4.0258 2.6053 3.8432 3.6732 4.0198 3.9909 3.6691 4.0695 3.1921 3.1781 3.2648 4.3434 3.1206 4.3706 3.9117 3.2320 4.0174 3.4425 0.9265 0.9009 0.8588 0.9310 0.8937 0.9420 0.9412 0.9411 0.9466 0.9175 0.9350 0.9364 0.9171 0.9096 0.9149
energy: -2314.549577217870
dipole: -0.27477 0.12324 -0.15153 -4.44297 3.39667 -1.04630 -2.64345 2.17751 -0.46595
magnitude: 1.15534 au
magnitude: 2.93665 debye
