program: Orca
programVersion: 5.0.4
elementType: S S Cl N N O O C C C C C C C C C C N N C N C C N C C H H H H H H H H H H H H H H H
keywords: PBE0 aug-cc-pVDZ AutoAux D4 VeryTightSCF
charge: 2
multiplicity: 1
formula: C15H15ClN6O2S2
InChI: InChI=1/C15H15ClN6O2S2/c16-6-3-1-5(2-4-6)7(8-10(17)19-14(25)21-12(8)23)9-11(18)20-15(26)22-13(9)24/h1-4,7,19-22H,17-18H3
41 atoms
S  3.610756 -1.764269 -4.182427
S  -5.602159 0.480089 -1.363361
Cl 1.892723 0.720956 5.628367
N  0.344678 -3.876843 -1.052108
N  -1.050719 1.475503 0.410503
O  1.182529 0.828645 -0.832984
O  -2.208001 -3.000358 -0.828983
C  -0.213394 -1.429845 0.414851
C  2.183886 -0.149477 3.093121
C  1.69915 -0.626703 1.885575
C  1.295552 0.119678 4.118893
C  0.339282 -0.830702 1.694745
C  -0.064047 -0.09161 3.96054
C  -0.532244 -0.573005 2.750078
C  -1.529285 -0.865184 -0.059212
C  -2.459016 -1.809414 -0.638953
C  -1.923051 0.423707 -0.03478
N  -3.686514 -1.316303 -0.995883
N  -3.148647 0.827584 -0.44144
C  -4.09822 -0.023853 -0.916014
N  1.860085 -2.728187 -2.450047
C  2.549605 -1.654492 -2.92765
C  1.011256 -2.649043 -1.403033
N  2.269533 -0.492343 -2.281261
C  0.754229 -1.505102 -0.735189
C  1.384611 -0.313425 -1.249504
H  0.470543 -4.609121 -1.757107
H  -0.692844 -3.669971 -0.944505
H  -0.07642 1.284097 0.008134
H  -1.359367 2.39694 0.084481
H  -0.462592 -2.454301 0.701874
H  3.246212 0.008918 3.229563
H  2.411076 -0.847705 1.099801
H  -0.751124 0.109391 4.772609
H  -1.596782 -0.749833 2.635514
H  2.727581 0.344125 -2.628288
H  2.012104 -3.615748 -2.918787
H  -3.402214 1.809192 -0.386712
H  -4.347624 -1.985726 -1.375138
H  -0.988119 1.507917 1.436015
H  0.698351 -4.243376 -0.159199
elementType: S Cl N O C H
totalener: -2314.52210653 hartree
nucrepener: 2848.88601269 hartree
electener: -5163.40811923 hartree
oneelecener: -8786.52846290 hartree
twoeener: 3623.12034367 hartree
cpcmener: -0.39458335 hartree
kineticenergy: 2306.75032091 hartree
exchangeener: -161.885769153654 hartree
correlationener: -7.443799789656 hartree
xcener: -169.329568943310 hartree
chargesum: 2.0000000
charge: -0.221601 -0.229007 -0.322169 -0.646320 -0.641841 -1.047880 -1.007182 1.197040 0.072824 0.972810 0.035116 1.509406 0.038321 0.956581 1.366072 0.818229 0.460363 -0.565921 -0.363134 0.443397 -0.493030 0.397747 1.409748 -0.387280 0.247577 0.095137 0.293687 0.259260 0.252522 0.299230 -0.473593 -0.706367 -1.023621 -0.711236 -1.077404 0.032442 0.016772 -0.013382 0.058483 0.368593 0.329611
charge: 0.562739 0.556907 0.591381 0.539647 0.532136 0.167276 0.154301 -0.059345 0.003034 0.065355 -0.577246 -0.138554 0.002801 0.056227 -0.000406 -0.256422 -0.067927 0.183488 0.185213 -0.692389 0.187738 -0.690962 -0.057387 0.186387 -0.006643 -0.262733 0.118725 -0.035833 -0.053570 0.119188 0.065052 0.019557 0.028804 0.020427 0.043410 0.065262 0.075557 0.074184 0.064547 0.098210 0.131864
qa: -0.2216 -0.2290 -0.3222 -0.6463 -0.6418 -1.0479 -1.0072 1.1970 0.0728 0.9728 0.0351 1.5094 0.0383 0.9566 1.3661 0.8182 0.4604 -0.5659 -0.3631 0.4434 -0.4930 0.3977 1.4097 -0.3873 0.2476 0.0951 0.2937 0.2593 0.2525 0.2992 -0.4736 -0.7064 -1.0236 -0.7112 -1.0774 0.0324 0.0168 -0.0134 0.0585 0.3686 0.3296
va: 1.7862 1.7777 0.5672 2.7898 2.9414 1.3110 1.3322 1.6890 2.3231 -0.8495 2.4083 5.0861 2.3353 -1.8900 0.6822 -1.3320 -2.6402 2.7888 2.4389 3.1431 2.7904 3.2397 -7.5288 2.7765 2.5565 1.9551 0.7130 0.9555 0.9233 0.7099 0.5496 0.4071 -0.4894 0.4056 -0.3808 0.8635 0.8512 0.8670 0.8454 0.7503 0.8103
energy: 29990.3 30126.4 32414.2 33362.6 33782.1 34059.3 34130.4 35241.2 35900.4 36488.6 36860.3 37084.4 38537.6 38829.3 39480.6 40067.2 40747.2 40798.3 40889.4 41315.6 41683.0 42202.0 42490.3 44299.8 44376.6 44706.6 44919.2 45259.8 45428.0 45804.4 45891.9 46252.9 46327.6 46646.4 46720.2 47395.5 47491.7 47591.5 47772.2 47822.3 48035.8 48147.4 48251.9 48584.9 49259.5 49604.7 49769.7 50493.8 50787.3 51291.8 51404.6 51738.8 51947.5 52041.6 52206.6 52350.9 52405.8 52542.2 52567.0 52710.5 52909.8 53339.8 53443.4 53467.7 53510.7 53602.0 53776.9 53941.4 54049.7 54115.4 54162.4 54339.5 54611.3 54672.0 54724.2 54826.6 54957.5 55420.6 55448.8 55825.5 55993.6 56111.1 56210.7 56297.3 56470.1 56514.9 56632.6 56673.1 56791.3 56859.2 56887.1 56910.2 56936.4 57072.5 57130.9 57221.0 57341.9 57398.5 57582.9 57638.9 57822.6 57847.3 58037.3 58173.4 58219.5 58257.2 58329.2 58397.6 58451.2 58472.6 58518.1 58801.4 58894.7 59068.5 59142.9 59182.2 59229.6 59327.5 59445.8 59593.0 59697.9 59779.9 59923.0 60001.2 60041.3 60202.4 60344.8 60537.0 60630.4 60684.9 60759.1 60822.3 60957.2 60995.3 61054.6 61169.5 61216.1 61305.8 61320.9 61409.4 61497.1 61577.8 61596.9 61683.3 61731.7 61859.4 61937.7 61985.1 62014.0 62081.8 62107.5 62241.6 62391.2 62426.7 62526.3 62534.1 62640.2 62792.7 62917.5 63028.3 63077.7 63167.7 63203.6 63240.4 63250.9 63476.2 63513.9 63572.4 63592.1 63671.7 63813.4 63822.8 63934.0 63993.4 64051.2 64111.1 64180.4 64331.3 64372.1 64467.1 64496.9 64623.1 64725.5 64838.4 64876.4 64920.5 64981.0 65082.6 65159.1 65204.3 65223.4 65281.2 65378.1 65462.8 65530.0 65567.7 65613.5 65705.1 65812.2 65846.5
energy: -2314.445062298249
dipole: -2.69118 2.07306 -0.61812 -5.66939 3.03300 -2.63638 -4.60983 3.63151 -0.97832
magnitude: 2.87919 au
magnitude: 7.31831 debye
