program: Orca
programVersion: 5.0.4
elementType: S S Cl N N O O C C C C C C C C C C N N C N C C N C C H H H H H H H H H H H H H
keywords: PBE0 ma-def2-TZVP AutoAux D4 VeryTightSCF TightOPT MORead
charge: 0
multiplicity: 1
formula: C15H13ClN6O2S2
InChI: InChI=1/C15H13ClN6O2S2/c16-6-3-1-5(2-4-6)7(8-10(17)19-14(25)21-12(8)23)9-11(18)20-15(26)22-13(9)24/h1-4,7,19-22H,17-18H2
39 atoms
S  4.183483 -4.106758 -2.087928
S  -5.73796 -1.515962 -1.414877
Cl 1.329254 4.454568 2.692093
N  1.059685 -0.315448 -1.915491
N  -1.959496 -3.239664 1.222267
O  0.957058 -3.552185 1.556256
O  -1.423481 0.779872 -1.259178
C  -0.146944 -1.050954 0.714139
C  1.889709 2.074533 1.549581
C  1.543605 0.816711 1.075478
C  0.910631 2.876376 2.105031
C  0.235598 0.356551 1.143714
C  -0.400497 2.437849 2.203114
C  -0.725095 1.181519 1.724138
C  -1.52362 -1.157962 0.100409
C  -2.035678 -0.198884 -0.798669
C  -2.330586 -2.235489 0.430736
N  -3.356953 -0.365209 -1.20553
N  -3.607225 -2.305449 -0.06051
C  -4.170403 -1.381859 -0.871522
N  2.438921 -2.137372 -1.837825
C  2.957962 -3.275949 -1.326908
C  1.439856 -1.400491 -1.254146
N  2.399032 -3.677091 -0.170452
C  0.916707 -1.807119 -0.037713
C  1.382604 -3.019942 0.515991
H  2.825941 -1.821962 -2.718555
H  -4.183898 -3.09909 0.187379
H  1.452179 -0.115289 -2.821774
H  0.233089 0.207882 -1.617502
H  -0.981335 -3.365257 1.472048
H  -2.589175 -4.011671 1.379463
H  2.737631 -4.537584 0.240265
H  -3.723349 0.336361 -1.835761
H  -0.214476 -1.583569 1.668411
H  2.913252 2.422202 1.484228
H  2.319729 0.190487 0.652213
H  -1.158916 3.07027 2.647728
H  -1.75187 0.840997 1.802016
totalener: -2313.94490074 hartree
nucrepener: 2782.74745176 hartree
electener: -5096.69235251 hartree
oneelecener: -8710.26685371 hartree
twoeener: 3613.57450120 hartree
cpcmener: -0.07299407 hartree
kineticenergy: 2307.45397031 hartree
exchangeener: -161.837851713397 hartree
correlationener: -7.429187333077 hartree
xcener: -169.267039046474 hartree
elementType: S Cl N O C H
chargesum: -0.0000000
charge: -0.562448 -0.561230 -0.199584 -0.509408 -0.604625 -0.666011 -0.598370 -0.646809 0.207807 -0.132831 -0.148896 -0.558414 0.038526 -0.009083 0.908879 0.403928 0.111807 -0.195380 -0.146089 0.194781 -0.161652 0.178288 0.351356 -0.224062 -0.263635 0.217157 0.324795 0.323360 0.329204 0.330969 0.321438 0.332309 0.320284 0.322538 0.178130 0.194682 0.204603 0.196328 0.197357
charge: 0.145132 0.145782 0.371735 0.027663 0.021088 -0.107682 -0.086470 -0.151525 -0.168453 -0.122637 -0.458606 -0.150836 -0.169370 -0.113600 -0.132220 -0.380451 -0.252052 0.130141 0.134312 -0.613737 0.132066 -0.613245 -0.264628 0.128439 -0.137452 -0.378062 0.269444 0.269099 0.233272 0.229962 0.226479 0.232778 0.267556 0.268261 0.246297 0.198306 0.212747 0.198434 0.212032
qa: -0.5624 -0.5612 -0.1996 -0.5094 -0.6046 -0.6660 -0.5984 -0.6468 0.2078 -0.1328 -0.1489 -0.5584 0.0385 -0.0091 0.9089 0.4039 0.1118 -0.1954 -0.1461 0.1948 -0.1617 0.1783 0.3514 -0.2241 -0.2636 0.2172 0.3248 0.3234 0.3292 0.3310 0.3214 0.3323 0.3203 0.3225 0.1781 0.1947 0.2046 0.1963 0.1974
va: 1.6536 1.6565 0.9985 2.9523 3.1348 1.7169 1.6999 3.5583 3.2305 4.1966 4.0554 5.4496 3.8798 3.8834 1.2082 4.0533 4.3627 3.2605 3.1808 4.0051 3.2112 4.0570 3.9680 3.2700 3.7585 4.1228 0.9032 0.9027 0.9078 0.9275 0.9232 0.9058 0.9063 0.9035 0.9448 0.9422 0.9345 0.9402 0.9308
energy: -2314.004376832752
dipole: -2.28224 1.79962 -0.48262 -8.27859 7.24951 -1.02908 -1.73701 1.51311 -0.22389
magnitude: 1.15847 au
magnitude: 2.94460 debye
