program: Gaussian 16
title: from FREQ to TS
version: ES64L-G16RevC.01
method: RPBE1PBE
basis: def2SVPP
operation: Freq
keyword: #N
keyword: Geom=AllCheck
keyword: Guess=TCheck
keyword: SCRF=Check
keyword: GenChk
keyword: RPBE1PBE/def2SVPPFreq
converged: YES YES NO YES
title: Mulliken charges:
elementType: C Rh Rh O C O O C O O C O O C O C C C C C H C H H H C H H C C C C C C C H H C C C C C C H H C C C C C C H H C C C C C C H H C H H H C H H H C H H H C H H H C H H H C H H H C H H H C H H H C H H H C H H H C H H H C H H H C C C C H C H C H H H H C H H C H H O H H
charge: -0.236276 0.013713 0.522701 -0.294960 0.399274 -0.482066 -0.371060 0.353808 -0.352860 -0.368973 0.324858 -0.359612 -0.361147 0.362426 -0.366420 0.104312 -0.035376 -0.218271 -0.184329 -0.130586 0.181215 -0.118634 0.093076 0.110283 0.103772 -0.348397 0.226385 0.141419 0.139527 -0.019951 -0.042374 -0.022643 -0.240230 -0.242314 0.030320 0.090312 0.089466 0.006638 -0.034587 -0.022866 -0.245319 -0.251166 0.029104 0.088767 0.087851 -0.100191 -0.021778 0.023295 -0.236577 -0.237107 0.035457 0.099458 0.100641 -0.010471 -0.047797 -0.035261 -0.252313 -0.253287 0.032545 0.089206 0.089672 -0.332081 0.171070 0.233041 0.132220 -0.293645 0.177895 0.165909 0.137756 -0.300804 0.155435 0.144898 0.141494 -0.405328 0.243657 0.187184 0.160430 -0.315212 0.185981 0.173519 0.146624 -0.297715 0.157737 0.153950 0.146460 -0.363676 0.190861 0.142621 0.176283 -0.352483 0.226676 0.169681 0.137036 -0.300662 0.145187 0.154546 0.140203 -0.364800 0.145682 0.206546 0.170918 -0.313672 0.192326 0.165080 0.136195 -0.298435 0.152271 0.149537 0.140429 0.122444 -0.170690 -0.189138 -0.123472 0.121880 -0.125460 0.101156 -0.134787 0.104017 0.105526 0.107000 0.095764 -0.225946 0.162073 0.195898 -0.179528 0.147583 0.117526 -0.307075 0.471072 0.161031
chargesum: -0.00000
title: Mulliken charges with hydrogens summed into heavy atoms:
elementType: C Rh Rh O C O O C O O C O O C O C C C C C C C C C C C C C C C C C C C C C C C C C C C C C C C C C C C C C C C C C C C C C C C C C C C C O
charge: -0.140511 0.013713 0.522701 -0.294960 0.399274 -0.010993 -0.371060 0.353808 -0.352860 -0.368973 0.324858 -0.359612 -0.361147 0.362426 -0.366420 0.104312 -0.035376 -0.037056 -0.091253 -0.020303 -0.014861 0.019406 0.300558 -0.019951 -0.042374 -0.022643 -0.149919 -0.152848 0.030320 0.006638 -0.034587 -0.022866 -0.156552 -0.163315 0.029104 -0.100191 -0.021778 0.023295 -0.137120 -0.136466 0.035457 -0.010471 -0.047797 -0.035261 -0.163107 -0.163615 0.032545 0.204250 0.187915 0.141023 0.185943 0.190912 0.160432 0.146089 0.180910 0.139274 0.158346 0.179930 0.143801 0.122444 -0.048810 -0.087982 -0.019455 -0.019934 -0.027787 0.132026 0.085581 -0.307075
chargesum: -0.00004
1716.lowfreq: -5.7594 -0.0013 -0.0008 0.0006 2.0087 5.5237 15.1509 17.5249 22.6367
temp: 298.150 k
press: 1.00000 atm
elementType: 6 45 45 8 6 8 8 6 8 8 6 8 8 6 8 6 6 6 6 6 1 6 1 1 1 6 1 1 6 6 6 6 6 6 6 1 1 6 6 6 6 6 6 1 1 6 6 6 6 6 6 1 1 6 6 6 6 6 6 1 1 6 1 1 1 6 1 1 1 6 1 1 1 6 1 1 1 6 1 1 1 6 1 1 1 6 1 1 1 6 1 1 1 6 1 1 1 6 1 1 1 6 1 1 1 6 1 1 1 6 6 6 6 1 6 1 6 1 1 1 1 6 1 1 6 1 1 8 1 1
symmnumber: 1
zpe: 2799679.4 jmol-1
zpe.correction: 1.066342 hartree
zpe.thermalcorrener: 1.136972 hartree
zpe.thermalcorrenthalpy: 1.137916 hartree
zpe.thermalcorrgfe: 0.955204 hartree
zpe.sumelectzpe: -3101.400852 hartree
zpe.sumelectthermal: -3101.330222 hartree
zpe.sumelectthermalent: -3101.329277 hartree
zpe.sumelectthermalfe: -3101.511990 hartree
dipole: 3.1448 -12.7156 -3.6482
dipole: 13.5972
quadrupole: -440.4859 -331.0659 -384.7404
quadrupole: -28.2678 9.9110 14.6930
quadrupole: -55.0552 54.3649 0.6903 -28.2678 9.9110 14.6930
hfenergy: -3102.4671932 hartree
pointgroup: C01 [X(C57H62O9Rh2)]
dipole: 1.2372429 -5.0026958 -1.435327 debye
polarizability: 902.1081757|52.1650145|1083.8946584|61.4822013|-0.0420685|1093.1015047 unknown
InChI: InChI=1/57C.9O.2Rh.62H
charge 0 multiplicity 1
130 atoms
C  2.56943941 0.29242122 0.16283453
Rh 0.40685358 0.14485428 0.27271615
Rh -2.05146498 -0.21976718 0.41194212
O  -1.78166271 -1.97536881 -0.67948007
C  -0.69518277 -2.37982078 -1.07316448
O  0.42825963 -1.81679037 -0.6280003
O  -1.69405383 -1.170125 2.20993769
C  -0.53050377 -1.17108967 2.69007152
O  0.50052118 -0.67406525 2.1557666
O  -2.18021223 0.73987074 -1.40785177
C  -1.12664229 1.04928373 -2.02651085
O  0.05598703 0.88253035 -1.61113855
O  0.07805613 2.01348347 0.99776546
C  -1.10211673 2.35718269 1.31482853
O  -2.10773787 1.60067474 1.33036003
C  3.13012563 0.39120865 1.53688478
C  3.87280306 -0.6692364 2.11644243
C  2.9003392 1.5305844 2.32871989
C  4.35712149 -0.53815421 3.42453289
C  3.3937021 1.64955292 3.62436591
H  2.26395055 2.31882787 1.92765603
C  4.13478728 0.60863615 4.18316435
H  4.9306427 -1.36688267 3.85495496
H  3.1823011 2.55343663 4.20500658
H  4.52872755 0.68365029 5.20157183
C  2.95625608 -2.95524521 1.5455947
H  2.00821039 -2.4619567 1.27914413
H  2.85323946 -3.23284516 2.60819385
C  3.09543007 -4.03868644 -0.74988188
C  -1.33809077 3.79828371 1.64800242
C  -2.33272732 4.49595121 0.92041558
C  -0.59139514 4.45555345 2.64136522
C  -2.53128839 5.84955666 1.19266083
C  -0.84989424 5.80839582 2.89544081
C  -1.80437946 6.52742993 2.17853595
H  -3.2865543 6.39501689 0.61620181
H  -0.27786161 6.31208803 3.68233936
C  -0.32380182 -1.83100887 4.02061513
C  -0.02503912 -1.04081901 5.14428602
C  -0.40261076 -3.22907408 4.11921806
C  0.18171612 -1.67718653 6.37029392
C  -0.17276981 -3.82626898 5.36277128
C  0.11411554 -3.06870587 6.50181712
H  0.40821217 -1.06493579 7.25011191
H  -0.22027314 -4.91786049 5.44138605
C  -0.57341487 -3.48724342 -2.04708571
C  -1.21439959 -4.71613195 -1.76142922
C  0.11672389 -3.28724355 -3.25911635
C  -1.09455634 -5.75036763 -2.68573975
C  0.18170158 -4.35395914 -4.1621049
C  -0.39853652 -5.59240146 -3.89211822
H  -1.56919405 -6.71153349 -2.46251333
H  0.7029971 -4.20099061 -5.11275273
C  -1.26565131 1.6585031 -3.38383442
C  -1.95883456 0.96266686 -4.39135646
C  -0.67410435 2.91243259 -3.63995256
C  -2.02834149 1.53418674 -5.66649947
C  -0.79178721 3.45151602 -4.92274923
C  -1.45763021 2.77699504 -5.95226169
H  -2.5475146 0.98780203 -6.46141463
H  -0.34242142 4.42979101 -5.12562859
C  0.05664536 3.67265313 -2.56999361
H  -0.53788068 3.74503397 -1.6432302
H  1.00174385 3.17426779 -2.30049068
H  0.2878851 4.69542063 -2.90920359
C  -2.61751614 -0.36534273 -4.1386681
H  -2.00599719 -1.02373403 -3.50146651
H  -3.58400428 -0.234727 -3.62062186
H  -2.81108598 -0.88948043 -5.08895855
C  -1.57843448 3.38971905 -7.31772367
H  -2.40997657 4.11900474 -7.34933125
H  -0.66024674 3.93349952 -7.59879147
H  -1.78052404 2.62597026 -8.08714594
C  0.76041645 -1.98727391 -3.65141391
H  0.45732687 -1.13136884 -3.03208348
H  1.85879099 -2.07408849 -3.58497283
H  0.51362536 -1.74589924 -4.69888375
C  -2.01040139 -4.92907603 -0.50681155
H  -1.48839925 -4.55230862 0.38658561
H  -2.97841769 -4.40096894 -0.55856699
H  -2.21628237 -6.00107131 -0.35902773
C  -0.2853713 -6.7333112 -4.85865635
H  0.37895382 -7.52085101 -4.45701907
H  -1.26818919 -7.20282688 -5.03897675
H  0.12710919 -6.40453733 -5.82629318
C  -0.72042839 -4.07032045 2.91674018
H  -0.1174594 -3.7676836 2.04237717
H  -0.5247752 -5.13689698 3.11470256
H  -1.78128857 -3.96619491 2.63010819
C  0.08243659 0.45084163 5.02535973
H  0.99057909 0.72977005 4.4643053
H  -0.77928027 0.87585235 4.48152421
H  0.13056996 0.92715682 6.01821684
C  0.32069466 -3.72319003 7.83762818
H  1.1410425 -3.24384445 8.39924879
H  -0.58937236 -3.64198227 8.46151872
H  0.55324195 -4.795838 7.73065766
C  0.46454779 3.77090392 3.45924129
H  0.37564467 4.05684037 4.52149715
H  0.41439596 2.67770603 3.38755936
H  1.47069574 4.07890478 3.12326058
C  -3.18562673 3.84029346 -0.13026033
H  -2.63540398 3.10400027 -0.73431194
H  -4.02636988 3.29329613 0.33256821
H  -3.60972474 4.60052552 -0.80660054
C  -2.05203138 7.98414527 2.44276431
H  -1.79092228 8.59612375 1.55993211
H  -3.11789447 8.17510242 2.661771
H  -1.45549565 8.34760736 3.29558463
C  2.97085516 1.280798 -0.87127652
C  2.99227618 0.85576852 -2.21652704
C  3.34675796 2.61530966 -0.62689244
C  3.35463232 1.70530023 -3.25572955
H  2.7138941 -0.1778186 -2.44274395
C  3.71690407 3.46967033 -1.66663635
H  3.37016288 3.00110064 0.39290212
C  3.72170563 3.02728114 -2.98927958
H  3.35253782 1.33130738 -4.28498624
H  4.00575155 4.49990365 -1.43295668
H  4.00798251 3.7015703 -3.80235691
H  2.768102 -0.70317499 -0.25364726
C  3.15811875 -4.22038521 0.72466408
H  4.11202184 -4.72118921 0.96711457
H  2.36993386 -4.97208446 0.94772728
C  4.12169001 -1.97049046 1.39893192
H  4.33101828 -1.7890872 0.33015962
H  5.02941113 -2.44353051 1.81289789
O  2.45678751 -3.17456856 -1.32960825
H  1.29640386 -2.32498297 -0.87572524
H  3.65624785 -4.76840873 -1.37320671
