program: Gaussian 16
title: from FREQ to TS
version: ES64L-G16RevC.01
method: RPBE1PBE
basis: def2SVPP
operation: Freq
keyword: #P
keyword: Geom=AllCheck
keyword: Guess=TCheck
keyword: SCRF=Check
keyword: GenChk
keyword: RPBE1PBE/def2SVPPFreq
converged: YES YES NO YES
title: Mulliken charges:
elementType: C Rh Rh O C O O C O O C O O C O C C C C C H C H H H C H H C H C C C C C C H H C C C C C C H H C C C C C C H H C C C C C C H H C H H H C H H H C H H H C H H H C H H H C H H H C H H H C H H H C H H H C H H H C H H H C H H H O C C C C H C H C H H H H C H H H
charge: -0.341474 -0.066654 0.584033 -0.360597 0.337166 -0.373085 -0.369661 0.352323 -0.370454 -0.372217 0.355047 -0.360367 -0.357742 0.360222 -0.368622 0.096055 -0.038071 -0.146697 -0.191994 -0.123532 0.135137 -0.116362 0.100332 0.111308 0.112347 -0.107080 0.214040 0.170660 -0.053716 0.228495 -0.028057 -0.041578 -0.029549 -0.252000 -0.254275 0.031495 0.089735 0.088212 -0.025757 -0.037927 -0.022826 -0.241433 -0.247902 0.030108 0.091220 0.089617 -0.024032 -0.044778 -0.033187 -0.239624 -0.242950 0.025294 0.090065 0.090032 -0.014251 -0.042432 -0.034670 -0.246499 -0.246475 0.028817 0.089580 0.089628 -0.327493 0.189576 0.183246 0.134856 -0.292256 0.169368 0.163278 0.136095 -0.300455 0.143273 0.155793 0.143065 -0.344364 0.207837 0.172364 0.151531 -0.307771 0.189020 0.165681 0.140691 -0.299290 0.148900 0.140943 0.151357 -0.368842 0.214657 0.166468 0.147193 -0.313905 0.196506 0.164999 0.137987 -0.298881 0.150680 0.140101 0.151768 -0.357161 0.183481 0.235721 0.132943 -0.301872 0.179765 0.164070 0.138396 -0.301383 0.141445 0.144706 0.153822 -0.230107 0.109267 -0.196324 -0.175513 -0.137665 0.198985 -0.109027 0.120987 -0.110866 0.120640 0.112080 0.114408 0.267497 -0.172877 0.191620 0.179890 0.176654
chargesum: -0.00000
title: Mulliken charges with hydrogens summed into heavy atoms:
elementType: C Rh Rh O C O O C O O C O O C O C C C C C C C C C C C C C C C C C C C C C C C C C C C C C C C C C C C C C C C C C C C C O C C C C C C C
charge: -0.073977 -0.066654 0.584033 -0.360597 0.337166 -0.373085 -0.369661 0.352323 -0.370454 -0.372217 0.355047 -0.360367 -0.357742 0.360222 -0.368622 0.096055 -0.038071 -0.011560 -0.091662 -0.012224 -0.004015 0.277621 0.174779 -0.028057 -0.041578 -0.029549 -0.162265 -0.166064 0.031495 -0.025757 -0.037927 -0.022826 -0.150213 -0.158284 0.030108 -0.024032 -0.044778 -0.033187 -0.149558 -0.152918 0.025294 -0.014251 -0.042432 -0.034670 -0.156919 -0.156846 0.028817 0.180185 0.176485 0.141675 0.187368 0.187621 0.141910 0.159476 0.185587 0.143668 0.194984 0.180359 0.138590 -0.230107 0.109267 0.002661 -0.054525 -0.017025 0.003053 0.003542 0.375288
polarizability: 9.48861075e+02 4.56874842e+00 1.04421279e+03 3.22324788e+01 -1.53246030e+01 1.08110577e+03
1716.lowfreq: -184.9271 -4.6041 -0.0008 0.0003 0.0007 3.8555 7.2605 10.2507 11.5442
temp: 298.150 k
press: 1.00000 atm
elementType: 6 45 45 8 6 8 8 6 8 8 6 8 8 6 8 6 6 6 6 6 1 6 1 1 1 6 1 1 6 1 6 6 6 6 6 6 1 1 6 6 6 6 6 6 1 1 6 6 6 6 6 6 1 1 6 6 6 6 6 6 1 1 6 1 1 1 6 1 1 1 6 1 1 1 6 1 1 1 6 1 1 1 6 1 1 1 6 1 1 1 6 1 1 1 6 1 1 1 6 1 1 1 6 1 1 1 6 1 1 1 8 6 6 6 6 1 6 1 6 1 1 1 1 6 1 1 1
symmnumber: 1
zpe: 2719623.9 jmol-1
zpe.correction: 1.035850 hartree
zpe.thermalcorrener: 1.105297 hartree
zpe.thermalcorrenthalpy: 1.106242 hartree
zpe.thermalcorrgfe: 0.923953 hartree
zpe.sumelectzpe: -3062.164318 hartree
zpe.sumelectthermal: -3062.094871 hartree
zpe.sumelectthermalent: -3062.093927 hartree
zpe.sumelectthermalfe: -3062.276216 hartree
dipole: 10.5861 -6.4966 0.2619
dipole: 12.4233
quadrupole: -393.8281 -365.1926 -373.9062
quadrupole: -22.6169 4.6370 -3.0703
quadrupole: -16.1858 12.4497 3.7361 -22.6169 4.6370 -3.0703
hfenergy: -3063.2001682 hartree
pointgroup: C01[X(C56H60O9Rh2)]
dipole: 4.1648911 -2.5559492 0.1030512 debye
polarizability: 948.8610748|4.5687484|1044.2127863|32.2324788|-15.324603|1081.1057666 unknown
InChI: InChI=1/56C.9O.2Rh.60H
charge 0 multiplicity 1
127 atoms
C  2.50756257 0.10627106 -0.19514732
Rh 0.28603582 -0.00197192 -0.03189494
Rh -2.14313061 -0.09715805 0.20606121
O  -2.08815919 -1.84247052 -0.87405269
C  -0.98187426 -2.36089648 -1.16812984
O  0.15814176 -1.85951462 -0.93789172
O  -1.80208851 -1.20905558 1.90612429
C  -0.62830958 -1.42445031 2.30681528
O  0.42865019 -0.97071562 1.7777513
O  -2.26083468 0.99552544 -1.53259493
C  -1.20376402 1.23711934 -2.17581836
O  -0.03275364 0.91234559 -1.82939504
O  0.17193997 1.80788097 0.90839948
C  -0.92394358 2.22454464 1.37590344
O  -2.03919864 1.64861879 1.27680071
C  3.05498187 0.99505512 0.84858815
C  3.68730025 0.44902188 1.981632
C  2.97994262 2.39410371 0.74581154
C  4.2226868 1.27349891 2.97123891
C  3.52691516 3.21668745 1.72684776
H  2.47365255 2.83755347 -0.11469075
C  4.15083342 2.66057815 2.84558655
H  4.71537367 0.82311294 3.83881888
H  3.45386059 4.3036292 1.62188045
H  4.58154896 3.30514787 3.61783636
C  3.73315093 -1.0532236 2.06259851
H  2.80063287 -1.44140821 2.50483246
H  4.58158592 -1.39486534 2.68462009
C  3.87278591 -1.65874319 0.71208445
H  3.31788226 -2.57448499 0.45225727
C  -0.87126645 3.5272209 2.10740101
C  -1.57896496 4.63232945 1.60597749
C  -0.09775359 3.62531736 3.28029634
C  -1.4822272 5.84878781 2.29103187
C  -0.04567502 4.85553317 3.93866353
C  -0.72288998 5.98200793 3.45623934
H  -2.02051542 6.71894372 1.89969494
H  0.54392424 4.93709663 4.85844088
C  -0.46492428 -2.30262711 3.50556055
C  -1.16018306 -1.98782826 4.69469338
C  0.35323193 -3.44479433 3.431619
C  -0.99094333 -2.81502125 5.80445662
C  0.46863914 -4.25800653 4.56677235
C  -0.18278784 -3.95843648 5.76253512
H  -1.51356528 -2.5629116 6.73380184
H  1.0906353 -5.1579728 4.50716784
C  -1.01277521 -3.70383395 -1.82757294
C  -1.48663537 -4.80923483 -1.0900381
C  -0.58154828 -3.85055381 -3.15484074
C  -1.47675235 -6.06522611 -1.69718886
C  -0.61143129 -5.12814891 -3.72869632
C  -1.04147693 -6.24786631 -3.01633572
H  -1.82826726 -6.93070587 -1.12451638
H  -0.28769188 -5.24567889 -4.76884754
C  -1.32957404 1.9690815 -3.47124554
C  -2.21824575 1.49187206 -4.45537155
C  -0.54196099 3.11538158 -3.69985422
C  -2.299212 2.18057873 -5.6689229
C  -0.6805835 3.78439398 -4.91936256
C  -1.54883437 3.33373032 -5.91788218
H  -2.97285225 1.80196711 -6.44546362
H  -0.0825427 4.6848965 -5.09687036
C  0.43793161 3.63477055 -2.6836736
H  0.05543907 3.55718779 -1.65308737
H  1.37793176 3.05615704 -2.71464536
H  0.68068521 4.69066277 -2.88770876
C  -3.06323884 0.26535151 -4.24576223
H  -2.51305217 -0.53923226 -3.73054563
H  -3.94528663 0.49241842 -3.62170719
H  -3.42269227 -0.12386157 -5.21258024
C  -1.692612 4.08298962 -7.21096692
H  -1.95055254 3.40674469 -8.04347093
H  -2.49983479 4.83664033 -7.14009295
H  -0.7656352 4.62077332 -7.47216601
C  -0.11548216 -2.68891571 -3.98802996
H  -0.30834705 -1.71415821 -3.51604221
H  0.97011859 -2.75542604 -4.17908555
H  -0.61661965 -2.69498588 -4.97153942
C  -2.02197449 -4.65848649 0.30689712
H  -1.49373849 -3.88432829 0.88406803
H  -3.08645464 -4.36218542 0.28585456
H  -1.95090161 -5.61038111 0.85849839
C  -1.03853592 -7.61633382 -3.63476308
H  -2.01532526 -8.11585424 -3.50795397
H  -0.81191933 -7.57226752 -4.71277826
H  -0.28119507 -8.26521059 -3.15703419
C  1.09350679 -3.85657274 2.18672973
H  0.74396755 -3.33825005 1.28307588
H  2.17341054 -3.64574957 2.29099436
H  0.99193653 -4.94352966 2.02581732
C  -2.07435285 -0.79847922 4.79427532
H  -1.65908306 0.09247917 4.29577831
H  -3.04510431 -1.00527422 4.3108866
H  -2.26654205 -0.54707429 5.85016004
C  -0.03154661 -4.82888302 6.97626154
H  -1.01415637 -5.17479861 7.34432747
H  0.58633773 -5.71647629 6.76258421
H  0.44452545 -4.27411984 7.80540222
C  0.6352646 2.43451576 3.82938303
H  -0.05155823 1.58618873 3.99824431
H  1.40842914 2.08306055 3.12800719
H  1.11848904 2.67851965 4.78912505
C  -2.42853957 4.53026618 0.36958391
H  -1.94780515 3.92601735 -0.41805514
H  -3.39593818 4.04620264 0.59274873
H  -2.63851305 5.53021229 -0.04407776
C  -0.6115751 7.30255666 4.16265908
H  -1.43012987 7.98415156 3.87733021
H  -0.63067261 7.17609167 5.2589178
H  0.34150482 7.80524568 3.91132497
O  4.9702277 -1.43875764 0.06981033
C  3.05510841 0.21156115 -1.56456356
C  2.58662242 -0.65003573 -2.57591083
C  4.08605084 1.10720358 -1.90097001
C  3.1228499 -0.61827402 -3.85747892
H  1.78606477 -1.3521305 -2.33345847
C  4.61843426 1.14652532 -3.19037011
H  4.49380165 1.77525969 -1.13939575
C  4.14307785 0.28371183 -4.17686027
H  2.73704779 -1.29957726 -4.62261661
H  5.4208517 1.85511957 -3.41993134
H  4.56033139 0.31338615 -5.1882235
H  2.3929271 -0.96884205 0.11594224
C  5.28949197 -2.20472871 -1.09542388
H  5.49289716 -1.50024276 -1.91429208
H  6.19584801 -2.78682323 -0.86416547
H  4.45822738 -2.87531356 -1.36234353
