program: Gaussian 16
title: title
version: ES64L-G16RevC.01
method: RPBE1PBE
basis: def2SVPP
operation: Freq
keyword: #N
keyword: Geom=AllCheck
keyword: Guess=TCheck
keyword: SCRF=Check
keyword: GenChk
keyword: RPBE1PBE/def2SVPPFreq
converged: YES YES NO YES
title: Mulliken charges:
elementType: C Rh Rh O C O O C O O C O O C O C C C C C H C H H H C H H C C C C C C C H H C C C C C C H H C C C C C C H H C C C C C C H H C H H H C H H H C H H H C H H H C H H H C H H H C H H H C H H H C H H H C H H H C H H H C H H H C C C C H C H C H H H H C H H C H H O H H
charge: -0.380756 -0.062830 0.588689 -0.372900 0.345528 -0.352849 -0.343764 0.395167 -0.466769 -0.367049 0.363824 -0.361903 -0.368441 0.361951 -0.371806 0.011976 -0.068279 -0.176219 -0.179123 -0.121890 0.207607 -0.102349 0.100695 0.114504 0.112523 -0.204173 0.132108 0.134987 -0.040452 -0.016702 -0.039131 -0.041871 -0.246138 -0.247479 0.030875 0.090549 0.091965 -0.072953 -0.028590 -0.026869 -0.235958 -0.244892 0.032035 0.095248 0.095598 -0.019715 -0.042782 -0.033367 -0.253282 -0.250148 0.032423 0.090761 0.090027 -0.014444 -0.034913 -0.040553 -0.245241 -0.243317 0.029010 0.090510 0.090982 -0.309363 0.165771 0.138396 0.191272 -0.320119 0.139743 0.179656 0.173346 -0.299915 0.143654 0.143771 0.156668 -0.325119 0.167632 0.216064 0.132207 -0.301544 0.165626 0.136946 0.180903 -0.300419 0.154686 0.146423 0.141038 -0.344687 0.179026 0.149711 0.202506 -0.306543 0.171872 0.141843 0.188334 -0.298977 0.153842 0.142375 0.152780 -0.300228 0.181298 0.166117 0.137235 -0.311371 0.190401 0.133650 0.167981 -0.300063 0.145076 0.143401 0.156354 0.123103 -0.164279 -0.171256 -0.126133 0.152869 -0.113532 0.123275 -0.134452 0.105374 0.108845 0.109375 0.309291 -0.223532 0.184709 0.205567 -0.155083 0.160495 0.125166 -0.349479 0.451209 0.209567
chargesum: -0.00000
title: Mulliken charges with hydrogens summed into heavy atoms:
elementType: C Rh Rh O C O O C O O C O O C O C C C C C C C C C C C C C C C C C C C C C C C C C C C C C C C C C C C C C C C C C C C C C C C C C C C C O
charge: -0.071466 -0.062830 0.588689 -0.372900 0.345528 -0.352849 -0.343764 0.395167 -0.466769 -0.367049 0.363824 -0.361903 -0.368441 0.361951 -0.371806 0.011976 -0.068279 0.031388 -0.078429 -0.007386 0.010174 0.062922 0.169115 -0.016702 -0.039131 -0.041871 -0.155589 -0.155514 0.030875 -0.072953 -0.028590 -0.026869 -0.140710 -0.149294 0.032035 -0.019715 -0.042782 -0.033367 -0.162521 -0.160121 0.032423 -0.014444 -0.034913 -0.040553 -0.154731 -0.152335 0.029010 0.186076 0.172626 0.144178 0.190784 0.181933 0.141728 0.186556 0.195505 0.150021 0.184423 0.180661 0.144767 0.123103 -0.011411 -0.047981 -0.020759 -0.004687 -0.025078 0.166744 0.130578 0.101730
chargesum: -0.00004
1716.lowfreq: -317.0926 -0.0015 -0.0013 0.0006 3.6727 4.8369 8.4063 10.7745 14.3769
temp: 298.150 k
press: 1.00000 atm
elementType: 6 45 45 8 6 8 8 6 8 8 6 8 8 6 8 6 6 6 6 6 1 6 1 1 1 6 1 1 6 6 6 6 6 6 6 1 1 6 6 6 6 6 6 1 1 6 6 6 6 6 6 1 1 6 6 6 6 6 6 1 1 6 1 1 1 6 1 1 1 6 1 1 1 6 1 1 1 6 1 1 1 6 1 1 1 6 1 1 1 6 1 1 1 6 1 1 1 6 1 1 1 6 1 1 1 6 1 1 1 6 6 6 6 1 6 1 6 1 1 1 1 6 1 1 6 1 1 8 1 1
symmnumber: 1
zpe: 2798259.5 jmol-1
zpe.correction: 1.065801 hartree
zpe.thermalcorrener: 1.135179 hartree
zpe.thermalcorrenthalpy: 1.136123 hartree
zpe.thermalcorrgfe: 0.956652 hartree
zpe.sumelectzpe: -3101.375587 hartree
zpe.sumelectthermal: -3101.306209 hartree
zpe.sumelectthermalent: -3101.305265 hartree
zpe.sumelectthermalfe: -3101.484735 hartree
dipole: 2.0394 -6.6997 4.3696
dipole: 8.2546
quadrupole: -378.2302 -368.9627 -416.7896
quadrupole: -8.6752 2.1836 -8.3761
quadrupole: 9.7640 19.0314 -28.7954 -8.6752 2.1836 -8.3761
hfenergy: -3102.4413876 hartree
pointgroup: C01 [X(C57H62O9Rh2)]
dipole: 0.8023651 -2.6358494 1.7191163 debye
polarizability: 1092.6923884|20.1591071|1092.1043662|28.8955155|-10.4710463|994.8144771 unknown
InChI: InChI=1/57C.9O.2Rh.62H
charge 0 multiplicity 1
130 atoms
C  -0.03566218 -0.41581637 2.54959069
Rh -0.02911021 -0.00772358 0.18802332
Rh 0.04728373 0.27113102 -2.23029788
O  1.67498954 1.48907948 -1.97183506
C  2.11432545 1.67724012 -0.80413026
O  1.6128354 1.20885784 0.25421298
O  1.28645845 -1.37226246 -2.31949776
C  1.56612557 -2.01518343 -1.28756507
O  1.22055209 -1.67125543 -0.10245933
O  -1.17873855 1.8773301 -1.99224552
C  -1.50082324 2.25847879 -0.83500598
O  -1.21419665 1.66194996 0.24394425
O  -1.66893688 -1.1996532 -0.0903107
C  -2.10878759 -1.40441802 -1.25818413
O  -1.58769115 -0.97338477 -2.32134019
C  -1.32707654 -0.41852482 3.29671377
C  -1.3831526 -0.77697168 4.67020782
C  -2.52846811 -0.09092999 2.6510767
C  -2.61697104 -0.75970852 5.33204621
C  -3.75143335 -0.09620884 3.31991836
H  -2.48925336 0.18072278 1.59762893
C  -3.79801886 -0.42265497 4.67348071
H  -2.64746804 -1.03277298 6.39279628
H  -4.66668061 0.16534767 2.77953899
H  -4.74890947 -0.420405 5.2157158
C  -0.03416738 -2.8136441 5.30953149
H  -0.80118249 -3.30498403 5.93306043
H  0.94709155 -3.11252404 5.72011143
C  0.74019399 -2.81732831 2.88340605
C  -3.35613244 -2.21539605 -1.3732915
C  -3.4612459 -3.44300291 -0.68601988
C  -4.42560785 -1.72828234 -2.15225304
C  -4.64129342 -4.17912529 -0.81636286
C  -5.59500625 -2.49115013 -2.22750996
C  -5.72089119 -3.72220175 -1.57870879
H  -4.72158018 -5.14052775 -0.29746887
H  -6.43628394 -2.10750847 -2.81474546
C  2.32624212 -3.29010706 -1.41915738
C  1.79867991 -4.30885534 -2.24304674
C  3.5293984 -3.47368726 -0.71450118
C  2.49491994 -5.51411821 -2.32900762
C  4.20165575 -4.69295466 -0.85543786
C  3.70041212 -5.72622755 -1.64825427
H  2.08350911 -6.31602351 -2.95152602
H  5.14925266 -4.83575482 -0.32527144
C  3.3419032 2.5119146 -0.64697343
C  4.49989493 2.18346323 -1.37725725
C  3.3343958 3.59687103 0.25469916
C  5.65113392 2.95383299 -1.18080569
C  4.50236657 4.34882409 0.39694528
C  5.67266671 4.04292496 -0.30650287
H  6.56069597 2.69102034 -1.73168297
H  4.49880647 5.20036142 1.08621605
C  -2.27033352 3.53584053 -0.74524172
C  -3.51843153 3.56888053 -0.09451611
C  -1.7346538 4.69607736 -1.34180191
C  -4.21676714 4.77866925 -0.05055778
C  -2.45902744 5.88745757 -1.24569764
C  -3.70122387 5.95193486 -0.60812697
H  -5.19732996 4.80262893 0.4371273
H  -2.03965653 6.79498239 -1.69348654
C  -0.42664455 4.69542368 -2.08415785
H  -0.56731696 4.35749571 -3.12648723
H  -0.00132561 5.71198549 -2.11468781
H  0.31894345 4.02103655 -1.63578494
C  -4.11941569 2.34925971 0.54313291
H  -5.21108152 2.46383974 0.64509614
H  -3.92042916 1.43090116 -0.03365165
H  -3.70211433 2.19383302 1.55221329
C  -4.4482883 7.24974646 -0.5033324
H  -4.21978215 7.917446 -1.35106782
H  -5.53872952 7.08651696 -0.47075565
H  -4.17012386 7.78841982 0.42238665
C  2.11605731 3.95910058 1.05588197
H  1.20179766 3.96463372 0.43951275
H  1.94397389 3.23148348 1.86647416
H  2.23376597 4.95797896 1.50685257
C  4.54128507 1.03061492 -2.34235906
H  4.04231158 1.28847714 -3.29271962
H  5.58443812 0.7563744 -2.56975438
H  4.02708699 0.13771549 -1.94950921
C  6.90770648 4.87944459 -0.13606512
H  6.8014207 5.84919032 -0.65753534
H  7.09749275 5.10494558 0.92782669
H  7.79754094 4.37557274 -0.54835554
C  4.11810882 -2.41467548 0.17624703
H  3.76287739 -2.53361497 1.21621036
H  5.21694884 -2.49963395 0.19971412
H  3.85934682 -1.3933468 -0.14355382
C  0.51753232 -4.13236068 -3.00953569
H  0.67162674 -3.49952175 -3.90087236
H  0.13392132 -5.10853106 -3.34737621
H  -0.26702611 -3.64341637 -2.40816153
C  4.42566564 -7.03378799 -1.77773204
H  4.69444279 -7.23586974 -2.83033421
H  5.35183307 -7.04395986 -1.18026835
H  3.79118788 -7.87374194 -1.44157557
C  -4.36023308 -0.41569464 -2.88387935
H  -3.88697486 0.37705214 -2.28099892
H  -3.76446404 -0.50387249 -3.80883288
H  -5.37317259 -0.08149566 -3.16191395
C  -2.35269493 -3.97969359 0.17587547
H  -2.31237861 -3.45099645 1.14357891
H  -2.50619734 -5.05256183 0.37725752
H  -1.36190727 -3.85259015 -0.28860228
C  -6.96878667 -4.54523043 -1.71477317
H  -7.19969332 -5.0864908 -0.78140243
H  -7.83791474 -3.92076712 -1.98084936
H  -6.85236915 -5.30478257 -2.51098214
C  1.09616357 0.35358982 3.05435318
C  2.43126275 0.05578644 2.70511543
C  0.88992325 1.46167903 3.90460521
C  3.49690351 0.79721367 3.20253645
H  2.63354743 -0.75158446 1.99779081
C  1.95762356 2.20719037 4.39734801
H  -0.13199255 1.73942352 4.17794279
C  3.27231289 1.87737071 4.05976458
H  4.51752861 0.53604705 2.90417572
H  1.75779105 3.06255441 5.05103184
H  4.11092053 2.46373374 4.44722591
H  0.15731774 -1.31285717 1.94864385
C  -0.18863813 -3.35309634 3.89703603
H  -0.05732191 -4.45474432 3.88192098
H  -1.21707106 -3.18672103 3.51962864
C  -0.17880921 -1.29087754 5.41763684
H  0.74033474 -0.81350455 5.04996313
H  -0.264238 -1.02297675 6.48437684
O  0.67394871 -3.37524543 1.71277877
H  1.13207718 -2.82993758 0.98857547
H  1.6577191 -2.28022479 3.16670444
