program: Gaussian 16
title: from FREQ to TS
version: ES64L-G16RevC.01
method: RPBE1PBE
basis: def2SVPP
operation: Freq
keyword: #N
keyword: Geom=AllCheck
keyword: Guess=TCheck
keyword: SCRF=Check
keyword: GenChk
keyword: RPBE1PBE/def2SVPP
keyword: Freq
converged: YES YES NO NO
title: Mulliken charges:
elementType: C Rh Rh O C O O C O O C O O C O C C C C C H C H H H C H H C C C C C C C H H C C C C C C H H C C C C C C H H C C C C C C H H C H H H C H H H C H H H C H H H C H H H C H H H C H H H C H H H C H H H C H H H C H H H C H H H C C C C H C H C H H H H C H H O H H
charge: -0.393531 -0.034221 0.595103 -0.348824 0.399281 -0.462678 -0.367499 0.338244 -0.358272 -0.374211 0.361167 -0.360041 -0.353796 0.361951 -0.367523 0.114776 -0.036253 -0.165877 -0.187368 -0.130989 0.135738 -0.110358 0.100448 0.110524 0.110214 -0.241255 0.212465 0.132303 -0.103431 -0.024890 -0.038491 -0.031714 -0.255257 -0.250897 0.034150 0.091554 0.089790 -0.028658 -0.041561 -0.023119 -0.237854 -0.244023 0.027780 0.090434 0.089186 -0.052815 -0.037862 -0.029638 -0.237328 -0.245520 0.030648 0.094470 0.094592 -0.017983 -0.043512 -0.036352 -0.247976 -0.247261 0.030117 0.090773 0.090717 -0.321540 0.179670 0.197758 0.133463 -0.291622 0.172153 0.164900 0.136332 -0.300148 0.156696 0.143974 0.143355 -0.321542 0.188413 0.166775 0.148120 -0.302765 0.186082 0.169457 0.141962 -0.299032 0.147890 0.158271 0.143283 -0.337469 0.195222 0.152553 0.154209 -0.314431 0.201503 0.164432 0.139611 -0.298930 0.153909 0.147798 0.140698 -0.339963 0.167301 0.231016 0.133694 -0.301453 0.138649 0.181606 0.166926 -0.300594 0.140489 0.150291 0.150306 0.132992 -0.188699 -0.187699 -0.130306 0.181284 -0.112530 0.120392 -0.118379 0.111485 0.112236 0.114447 0.313418 -0.126498 0.165226 0.182762 -0.356388 0.447093 0.222300
chargesum: -0.00000
title: Mulliken charges with hydrogens summed into heavy atoms:
elementType: C Rh Rh O C O O C O O C O O C O C C C C C C C C C C C C C C C C C C C C C C C C C C C C C C C C C C C C C C C C C C C C C C C C C C C O
charge: -0.080113 -0.034221 0.595103 -0.348824 0.399281 -0.462678 -0.367499 0.338244 -0.358272 -0.374211 0.361167 -0.360041 -0.353796 0.361951 -0.367523 0.114776 -0.036253 -0.030139 -0.086919 -0.020465 -0.000144 0.103513 0.118869 -0.024890 -0.038491 -0.031714 -0.163704 -0.161107 0.034150 -0.028658 -0.041561 -0.023119 -0.147421 -0.154837 0.027780 -0.052815 -0.037862 -0.029638 -0.142858 -0.150928 0.030648 -0.017983 -0.043512 -0.036352 -0.157203 -0.156544 0.030117 0.189351 0.181764 0.143877 0.181767 0.194736 0.150412 0.164515 0.191114 0.143475 0.192048 0.185728 0.140492 0.132992 -0.007415 -0.067307 -0.018821 -0.000294 -0.003932 0.221490 0.090705
chargesum: 0.00000
1716.lowfreq: -230.5469 -9.1906 -3.8844 -0.0005 0.0001 0.0005 5.3023 9.8895 14.7170
temp: 298.150 k
press: 1.00000 atm
elementType: 6 45 45 8 6 8 8 6 8 8 6 8 8 6 8 6 6 6 6 6 1 6 1 1 1 6 1 1 6 6 6 6 6 6 6 1 1 6 6 6 6 6 6 1 1 6 6 6 6 6 6 1 1 6 6 6 6 6 6 1 1 6 1 1 1 6 1 1 1 6 1 1 1 6 1 1 1 6 1 1 1 6 1 1 1 6 1 1 1 6 1 1 1 6 1 1 1 6 1 1 1 6 1 1 1 6 1 1 1 6 6 6 6 1 6 1 6 1 1 1 1 6 1 1 8 1 1
symmnumber: 1
zpe: 2723050.2 jmol-1
zpe.correction: 1.037155 hartree
zpe.thermalcorrener: 1.105433 hartree
zpe.thermalcorrenthalpy: 1.106378 hartree
zpe.thermalcorrgfe: 0.929010 hartree
zpe.sumelectzpe: -3062.174288 hartree
zpe.sumelectthermal: -3062.106010 hartree
zpe.sumelectthermalent: -3062.105066 hartree
zpe.sumelectthermalfe: -3062.282433 hartree
dipole: 5.5617 -5.4593 -1.3644
dipole: 7.9119
quadrupole: -411.5152 -363.2104 -372.0463
quadrupole: -11.1429 2.6025 2.9896
quadrupole: -29.2579 19.0469 10.2110 -11.1429 2.6025 2.9896
hfenergy: -3063.2114431 hartree
pointgroup: C01 [X(C56H60O9Rh2)]
dipole: 2.1881416 -2.1478412 -0.5368012 debye
polarizability: 930.7072924|10.3562842|1083.1675068|18.578674|-17.3941527|1084.0586241 unknown
InChI: InChI=1/56C.9O.2Rh.60H
charge 0 multiplicity 1
127 atoms
C  2.63481306 0.13021734 -0.1947642
Rh 0.34645122 -0.02757325 -0.05238326
Rh -2.08550975 -0.161843 0.02089876
O  -1.92457688 -1.91188032 -1.06158115
C  -0.81267258 -2.4317876 -1.29373948
O  0.31379637 -1.86965659 -1.06105497
O  -1.85894841 -1.25730298 1.73819437
C  -0.71672837 -1.44992623 2.23421032
O  0.37868153 -1.05947988 1.73509893
O  -2.13367446 0.94777973 -1.70834651
C  -1.03958271 1.25716365 -2.25270227
O  0.10751745 0.98297153 -1.80206881
O  0.18485198 1.72785709 0.95444399
C  -0.95124245 2.14720186 1.3168802
O  -2.0519061 1.56972728 1.11027809
C  3.21004009 0.71448144 1.02455225
C  3.74661726 -0.07113555 2.07381299
C  3.21629343 2.11711014 1.16978224
C  4.27547154 0.57202423 3.20246472
C  3.74770047 2.73442883 2.29457043
H  2.75911073 2.72809793 0.38840859
C  4.28612749 1.95804353 3.32313466
H  4.69474372 -0.04321452 4.00566293
H  3.72018184 3.82533559 2.37832388
H  4.70410342 2.42959699 4.21779222
C  3.80108889 -1.5701777 2.00824828
H  2.78520502 -1.99666622 2.08683283
H  4.37021077 -1.94450315 2.8726053
C  3.47067133 -2.17549242 -0.38213153
C  -0.97641656 3.4508781 2.04538732
C  -1.70003288 4.52722564 1.50264852
C  -0.26480536 3.58507124 3.25506615
C  -1.68619153 5.74856847 2.18609688
C  -0.29907812 4.8176653 3.90935126
C  -0.99740166 5.91424954 3.38949143
H  -2.23422434 6.59639098 1.76118884
H  0.24003528 4.92610849 4.85695225
C  -0.66416752 -2.18664769 3.53460142
C  -1.37676224 -1.66481291 4.6376559
C  0.06885457 -3.38053623 3.65248389
C  -1.29406547 -2.33299271 5.85934984
C  0.10120512 -4.0257093 4.89511565
C  -0.55862621 -3.51485275 6.01226024
H  -1.82779639 -1.91984592 6.72237717
H  0.66255865 -4.9623042 4.98549616
C  -0.77662558 -3.81699302 -1.844786
C  -1.45575517 -4.8389406 -1.1459342
C  -0.05840191 -4.09827308 -3.02257994
C  -1.37848033 -6.14227446 -1.64032598
C  -0.03576827 -5.41573074 -3.49008848
C  -0.68112791 -6.452679 -2.81273841
H  -1.88510792 -6.94308973 -1.09101398
H  0.50714444 -5.63616207 -4.41537111
C  -1.07285221 1.99855665 -3.54654682
C  -1.89605846 1.53462906 -4.59325797
C  -0.24870749 3.13060845 -3.72006513
C  -1.87986707 2.22486455 -5.80852371
C  -0.28937261 3.79936354 -4.9466034
C  -1.09384301 3.36424916 -6.00360697
H  -2.5023811 1.8571489 -6.63142518
H  0.33728217 4.68754384 -5.08193246
C  0.67074467 3.63716166 -2.64327823
H  0.21008499 3.59496616 -1.64297879
H  1.58876629 3.02570405 -2.59113028
H  0.96403279 4.67964172 -2.84951498
C  -2.76409922 0.31397862 -4.45444906
H  -2.23922214 -0.51513301 -3.95032445
H  -3.66310771 0.52893211 -3.85159114
H  -3.09373785 -0.03695854 -5.4460871
C  -1.13128796 4.11481773 -7.30301191
H  -1.9013165 4.90906181 -7.27447452
H  -0.16585368 4.6045734 -7.51513153
H  -1.37927393 3.44964108 -8.14721673
C  0.67476776 -3.03701785 -3.79481837
H  0.16331496 -2.06141542 -3.7622481
H  1.69414542 -2.88903312 -3.39548339
H  0.77990888 -3.33433583 -4.8509837
C  -2.24845348 -4.57252772 0.10341064
H  -1.76384526 -3.83833081 0.76542994
H  -3.24404255 -4.16257773 -0.14231515
H  -2.39792144 -5.50616499 0.66951698
C  -0.65633907 -7.85781227 -3.33920231
H  -0.53867544 -8.59112733 -2.52296836
H  -1.60399769 -8.09855218 -3.85673574
H  0.16303655 -8.00500934 -4.06203277
C  0.76551355 -4.03342178 2.49098484
H  0.72391366 -3.43413385 1.57347641
H  1.82978385 -4.21345718 2.72134249
H  0.31130339 -5.01901737 2.28118442
C  -2.23633145 -0.43519672 4.53395656
H  -1.84885511 0.30100371 3.81426403
H  -3.25294101 -0.70096791 4.19147104
H  -2.33207664 0.05472758 5.51685788
C  -0.48234192 -4.19846484 7.34665806
H  0.13543067 -3.61447321 8.05406775
H  -1.48270686 -4.3015373 7.80266582
H  -0.03587123 -5.2029316 7.26163937
C  0.50744865 2.44012121 3.84586322
H  -0.09435393 1.51729997 3.88482591
H  1.39963594 2.20930495 3.2417758
H  0.83566325 2.678402 4.87059909
C  -2.47531483 4.39944545 0.22056602
H  -2.71369159 5.39439001 -0.18945669
H  -1.92150151 3.83477151 -0.54821545
H  -3.4262734 3.86234493 0.38314027
C  -0.9979244 7.2291197 4.11464233
H  -1.60027408 7.98390948 3.58286834
H  -1.40860445 7.12110296 5.13488199
H  0.02828702 7.62514422 4.22206284
C  3.0950076 0.56181067 -1.52953555
C  2.5507423 -0.02628331 -2.6904795
C  4.10703228 1.52245584 -1.71744848
C  2.9676199 0.34363427 -3.96337963
H  1.7627204 -0.77258033 -2.58364108
C  4.51690965 1.90585992 -2.99467796
H  4.59344338 1.97677608 -0.85196423
C  3.94747808 1.32623985 -4.12802328
H  2.51010047 -0.13121672 -4.8374523
H  5.30074706 2.66295169 -3.09996346
H  4.26829501 1.62967179 -5.12926326
H  2.3631752 -0.94075514 -0.11356698
C  4.45068565 -2.11808699 0.71550307
H  5.32167041 -1.51665511 0.41355689
H  4.79380359 -3.1541431 0.9036249
O  2.47921122 -3.01066849 -0.21814331
H  1.68755944 -2.79474127 -0.80263604
H  3.71913761 -1.85692498 -1.40465507
