program: Gaussian 16
title: from FREQ to TS
version: ES64L-G16RevC.01
method: RPBE1PBE
basis: def2SVPP
operation: Freq
keyword: #N
keyword: Geom=AllCheck
keyword: Guess=TCheck
keyword: SCRF=Check
keyword: GenChk
keyword: RPBE1PBE/def2SVPP
keyword: Freq
converged: YES YES NO NO
title: Mulliken charges:
elementType: C Rh Rh O C O O C O O C O O C O C C C C C H C H H H C H H C C C C C C C H H C C C C C C H H C C C C C C H H C C C C C C H H C H H H C H H H C H H H C H H H C H H H C H H H C H H H C H H H C H H H C H H H C H H H C H H H C C C C H C H C H H H H C H H O H H
charge: -0.186606 0.005661 0.574845 -0.355000 0.401019 -0.441439 -0.366084 0.353231 -0.361765 -0.370444 0.368058 -0.367876 -0.354424 0.361113 -0.365763 0.055756 0.002022 -0.154444 -0.199300 -0.121229 0.137638 -0.097405 0.106408 0.116404 0.115398 -0.233573 0.224548 0.122397 0.020867 -0.025778 -0.041511 -0.030271 -0.254233 -0.252595 0.034383 0.091580 0.089971 -0.038119 -0.042657 -0.021565 -0.241435 -0.241287 0.028069 0.089990 0.088662 -0.047815 -0.037547 -0.034187 -0.240479 -0.243296 0.030964 0.093694 0.093000 -0.016733 -0.042896 -0.037064 -0.246786 -0.245202 0.029580 0.091804 0.091221 -0.321233 0.185130 0.187569 0.135963 -0.290255 0.171221 0.166266 0.137448 -0.300098 0.157285 0.144103 0.143838 -0.312774 0.179503 0.166613 0.143807 -0.304396 0.188277 0.168734 0.140884 -0.299750 0.145409 0.158118 0.144977 -0.364895 0.218395 0.139241 0.157420 -0.316062 0.204752 0.165622 0.140417 -0.299590 0.155596 0.144691 0.142534 -0.342938 0.164660 0.238609 0.133358 -0.297983 0.138945 0.178025 0.167725 -0.300688 0.141149 0.148095 0.152641 0.009154 -0.122930 -0.125429 -0.122705 0.216807 -0.109724 0.143495 -0.079646 0.122898 0.124328 0.131381 0.090642 -0.186413 0.139493 0.146625 -0.479762 0.432744 0.161205
chargesum: -0.00000
title: Mulliken charges with hydrogens summed into heavy atoms:
elementType: C Rh Rh O C O O C O O C O O C O C C C C C C C C C C C C C C C C C C C C C C C C C C C C C C C C C C C C C C C C C C C C C C C C C C C O
charge: -0.186606 0.005661 0.574845 -0.355000 0.401019 -0.441439 -0.366084 0.353231 -0.361765 -0.370444 0.368058 -0.367876 -0.354424 0.361113 -0.365763 0.055756 0.002022 -0.016806 -0.092892 -0.004825 0.017994 0.113372 0.272714 -0.025778 -0.041511 -0.030271 -0.162653 -0.162624 0.034383 -0.038119 -0.042657 -0.021565 -0.151445 -0.152625 0.028069 -0.047815 -0.037547 -0.034187 -0.146785 -0.150295 0.030964 -0.016733 -0.042896 -0.037064 -0.154982 -0.153981 0.029580 0.187430 0.184680 0.145128 0.177149 0.193500 0.148755 0.150162 0.194729 0.143231 0.193689 0.186712 0.141196 0.009154 0.093877 0.018066 0.000193 0.014605 0.051735 0.099706 -0.047017
chargesum: 0.00000
1716.lowfreq: -97.1481 -5.6023 -0.0006 0.0006 0.0010 1.7118 5.9209 8.6576 14.6005
temp: 298.150 k
press: 1.00000 atm
elementType: 6 45 45 8 6 8 8 6 8 8 6 8 8 6 8 6 6 6 6 6 1 6 1 1 1 6 1 1 6 6 6 6 6 6 6 1 1 6 6 6 6 6 6 1 1 6 6 6 6 6 6 1 1 6 6 6 6 6 6 1 1 6 1 1 1 6 1 1 1 6 1 1 1 6 1 1 1 6 1 1 1 6 1 1 1 6 1 1 1 6 1 1 1 6 1 1 1 6 1 1 1 6 1 1 1 6 1 1 1 6 6 6 6 1 6 1 6 1 1 1 1 6 1 1 8 1 1
symmnumber: 1
zpe: 2721601.2 jmol-1
zpe.correction: 1.036603 hartree
zpe.thermalcorrener: 1.104955 hartree
zpe.thermalcorrenthalpy: 1.105900 hartree
zpe.thermalcorrgfe: 0.927383 hartree
zpe.sumelectzpe: -3062.171455 hartree
zpe.sumelectthermal: -3062.103102 hartree
zpe.sumelectthermalent: -3062.102158 hartree
zpe.sumelectthermalfe: -3062.280675 hartree
dipole: 6.6733 -0.0207 -2.8219
dipole: 7.2454
quadrupole: -406.6809 -373.6034 -363.2759
quadrupole: 3.1579 -2.9775 1.8440
quadrupole: -25.4942 7.5833 17.9109 3.1579 -2.9775 1.8440
hfenergy: -3063.2080579 hartree
pointgroup: C01 [X(C56H60O9Rh2)]
dipole: 2.6254697 -0.0081345 -1.1102108 debye
polarizability: 907.7663821|22.3682982|1061.4888493|18.0632165|-11.7581512|1088.1365512 unknown
InChI: InChI=1/56C.9O.2Rh.60H
charge 0 multiplicity 1
127 atoms
C  2.42324488 0.22073637 -0.28217859
Rh 0.36852228 -0.0894494 -0.13508589
Rh -2.08268336 -0.24647361 -0.0316825
O  -1.91368892 -1.96908302 -1.14780569
C  -0.79174977 -2.47311124 -1.37544496
O  0.32795778 -1.9055329 -1.13877311
O  -1.83739135 -1.36004125 1.66754637
C  -0.69426363 -1.50273882 2.17386597
O  0.39483882 -1.10953632 1.6599353
O  -2.16521726 0.91024629 -1.72825062
C  -1.08465622 1.24848106 -2.27537203
O  0.07404856 0.95055355 -1.86387059
O  0.1760444 1.66228319 0.8878104
C  -0.95839694 2.05588186 1.28780456
O  -2.05281379 1.46590632 1.09683366
C  3.06393552 0.78309729 0.92276134
C  3.55788115 0.04315276 2.02737584
C  3.12418276 2.19383782 0.96269854
C  4.11369254 0.75849262 3.09937877
C  3.66060036 2.87203487 2.04896353
H  2.71447984 2.76263153 0.12460624
C  4.17121035 2.1483291 3.12578873
H  4.51263188 0.19002379 3.94561432
H  3.67233585 3.96607444 2.0524184
H  4.60524541 2.66302271 3.98826188
C  3.56550033 -1.46247964 2.11067926
H  2.52576296 -1.82960333 2.14742796
H  4.04059926 -1.74622526 3.06271167
C  3.37684269 -2.2586705 -0.24083719
C  -0.97766819 3.34582074 2.04112082
C  -1.73273395 4.42057227 1.53921699
C  -0.22935196 3.47116272 3.22995056
C  -1.71436518 5.63094361 2.24168398
C  -0.25872049 4.69347265 3.90356456
C  -0.98811276 5.78818859 3.42396375
H  -2.28887602 6.47682873 1.84908312
H  0.3092713 4.79468649 4.8348757
C  -0.6269204 -2.15550014 3.51864335
C  -1.32932861 -1.55870811 4.5882759
C  0.11630092 -3.3343137 3.71500047
C  -1.22101045 -2.13105163 5.85756442
C  0.17724785 -3.87870882 5.00254062
C  -0.4684813 -3.28707724 6.08961539
H  -1.74746258 -1.65824588 6.69394535
H  0.74897983 -4.8007346 5.15536811
C  -0.73621445 -3.85848526 -1.92672035
C  -1.43032861 -4.88323974 -1.24908262
C  0.02273831 -4.13844325 -3.08058006
C  -1.33742412 -6.18635229 -1.74492779
C  0.06074676 -5.45348201 -3.550295
C  -0.60688558 -6.49300387 -2.89646975
H  -1.85656983 -6.98941587 -1.2109323
H  0.63576045 -5.67219456 -4.45648503
C  -1.13961921 2.0665302 -3.52147786
C  -1.97108836 1.66040474 -4.5852971
C  -0.33788271 3.22238023 -3.62774975
C  -1.98239952 2.43033812 -5.75153425
C  -0.40643105 3.97134699 -4.80580438
C  -1.21732466 3.59338351 -5.87976607
H  -2.61100976 2.1086858 -6.58892064
H  0.20140033 4.87892206 -4.88802752
C  0.58293676 3.67499333 -2.52749109
H  0.14301742 3.53784589 -1.52678332
H  1.52302991 3.09574891 -2.53837697
H  0.83702963 4.74013759 -2.65461157
C  -2.82106604 0.42170642 -4.51314065
H  -2.27417216 -0.43370519 -4.08122901
H  -3.70751667 0.58221757 -3.87579056
H  -3.17019104 0.13624665 -5.51896341
C  -1.28538166 4.42866382 -7.1250707
H  -2.06579528 5.20762944 -7.0317266
H  -0.33026623 4.94581622 -7.31797184
H  -1.53745345 3.81800642 -8.00833508
C  0.78468715 -3.07350914 -3.81823487
H  0.22578823 -2.12461573 -3.87556603
H  1.74535355 -2.85802473 -3.31863621
H  1.010467 -3.40242782 -4.84564722
C  -2.2505017 -4.62546898 -0.01554796
H  -1.76847817 -3.91252921 0.67184678
H  -3.23243967 -4.19310151 -0.2763459
H  -2.4285442 -5.56696195 0.52898016
C  -0.56584812 -7.89363822 -3.43388574
H  -0.68698922 -8.63855332 -2.62963585
H  -1.38532743 -8.05775167 -4.15912784
H  0.38174683 -8.09718346 -3.96046592
C  0.76843773 -4.07896033 2.58481518
H  0.94836447 -3.45761807 1.69832409
H  1.73908503 -4.49876234 2.89873425
H  0.13363611 -4.93222264 2.27863009
C  -2.21065464 -0.35316942 4.40838103
H  -1.86944443 0.31930405 3.60819778
H  -3.23604062 -0.66409628 4.1360336
H  -2.27539569 0.22284433 5.34606541
C  -0.34439062 -3.85854728 7.47230001
H  0.4568394 -3.3462396 8.0379607
H  -1.2781758 -3.73262394 8.04644951
H  -0.09332335 -4.9320832 7.44539555
C  0.5639602 2.32321349 3.78670402
H  -0.07404428 1.4411407 3.96438579
H  1.35451651 2.0070582 3.08930451
H  1.0334224 2.60107628 4.74399654
C  -2.5468794 4.3021084 0.28052964
H  -2.80934088 5.2999057 -0.10727959
H  -2.01159757 3.75490987 -0.51333586
H  -3.48608644 3.75172114 0.46531343
C  -0.96997201 7.09717199 4.15925228
H  -1.71710519 7.79914493 3.75370441
H  -1.17665898 6.95571772 5.23479593
H  0.02202676 7.58003143 4.08287351
C  3.05734129 0.51039399 -1.58009331
C  2.48709921 -0.00217043 -2.76446657
C  4.26471904 1.23361161 -1.69251052
C  3.06413988 0.23690721 -4.00480682
H  1.58452777 -0.60568558 -2.69239896
C  4.8331965 1.48963277 -2.93609283
H  4.76404175 1.60194713 -0.79433542
C  4.23112385 0.99926626 -4.09680839
H  2.59916561 -0.1713863 -4.90705204
H  5.761197 2.0655921 -2.99926018
H  4.68201338 1.19801319 -5.07410641
H  2.79674429 -1.23733953 -0.26330472
C  4.28431141 -2.16977967 0.95089708
H  5.2115777 -1.63601438 0.68252056
H  4.56411339 -3.19588053 1.25043718
O  2.43598926 -3.24177311 -0.11109794
H  1.65900305 -2.99906128 -0.6650221
H  3.88284607 -2.24317222 -1.229108
