program: Gaussian 16
title: from FREQ to TS
version: ES64L-G16RevC.01
method: RPBE1PBE
basis: def2SVPP
operation: Freq
keyword: #N
keyword: Geom=AllCheck
keyword: Guess=TCheck
keyword: SCRF=Check
keyword: GenChk
keyword: RPBE1PBE/def2SVPP
keyword: Freq
converged: YES YES NO YES
title: Mulliken charges:
elementType: C Rh Rh O C O O C O O C O O C O C C C C C H C H H H C H H C H C C C C C C H H C C C C C C H H C C C C C C H H C C C C C C H H C H H H C H H H C H H H C H H H C H H H C H H H C H H H C H H H C H H H C H H H C H H H C H H H O H C C C C H C H C H H H H C H H
charge: -0.185838 -0.034207 0.556473 -0.362552 0.366345 -0.377933 -0.363361 0.342662 -0.364944 -0.368741 0.363791 -0.369284 -0.356784 0.355900 -0.364882 0.048618 -0.001241 -0.140083 -0.196379 -0.120119 0.139796 -0.100629 0.106249 0.116825 0.115405 -0.241965 0.223637 0.119595 -0.125872 0.160434 -0.023357 -0.041572 -0.030453 -0.250999 -0.252305 0.032235 0.090849 0.089562 -0.033667 -0.039274 -0.013404 -0.238654 -0.245516 0.028665 0.090939 0.090201 -0.011448 -0.050278 -0.036963 -0.238851 -0.252242 0.030910 0.091927 0.092349 -0.016862 -0.040767 -0.035002 -0.243682 -0.249019 0.030621 0.091225 0.092010 -0.324509 0.190485 0.180960 0.138701 -0.301523 0.180197 0.167985 0.137997 -0.299859 0.153832 0.141159 0.148310 -0.336581 0.188170 0.171635 0.142997 -0.301543 0.183641 0.166454 0.138779 -0.299143 0.149556 0.154006 0.141010 -0.365472 0.212689 0.163612 0.153277 -0.312636 0.200485 0.165149 0.139514 -0.298815 0.153197 0.148749 0.140806 -0.342046 0.168884 0.231029 0.133025 -0.296699 0.174708 0.165294 0.138165 -0.300817 0.154488 0.141977 0.145731 -0.467849 0.379812 0.033580 -0.153249 -0.097082 -0.114827 0.228466 -0.107695 0.148123 -0.071628 0.126238 0.125995 0.134432 0.275517 -0.186910 0.134272 0.137704
chargesum: -0.00000
title: Mulliken charges with hydrogens summed into heavy atoms:
elementType: C Rh Rh O C O O C O O C O O C O C C C C C C C C C C C C C C C C C C C C C C C C C C C C C C C C C C C C C C C C C C C C O C C C C C C C
charge: -0.185838 -0.034207 0.556473 -0.362552 0.366345 -0.377933 -0.363361 0.342662 -0.364944 -0.368741 0.363791 -0.369284 -0.356784 0.355900 -0.364882 0.048618 -0.001241 -0.000287 -0.090129 -0.003293 0.014776 0.101267 0.310078 -0.023357 -0.041572 -0.030453 -0.160150 -0.162743 0.032235 -0.033667 -0.039274 -0.013404 -0.147715 -0.155315 0.028665 -0.011448 -0.050278 -0.036963 -0.146924 -0.159893 0.030910 -0.016862 -0.040767 -0.035002 -0.152457 -0.157009 0.030621 0.185637 0.184655 0.143442 0.166221 0.187331 0.145428 0.164105 0.192512 0.143937 0.190891 0.181469 0.141378 -0.088037 0.033580 0.075217 0.051041 0.011411 0.018300 0.062805 0.085067
chargesum: -0.00004
1716.lowfreq: -91.2772 -5.5966 -2.5659 -0.0012 -0.0012 0.0006 5.4794 11.8340 16.0698
temp: 298.150 k
press: 1.00000 atm
elementType: 6 45 45 8 6 8 8 6 8 8 6 8 8 6 8 6 6 6 6 6 1 6 1 1 1 6 1 1 6 1 6 6 6 6 6 6 1 1 6 6 6 6 6 6 1 1 6 6 6 6 6 6 1 1 6 6 6 6 6 6 1 1 6 1 1 1 6 1 1 1 6 1 1 1 6 1 1 1 6 1 1 1 6 1 1 1 6 1 1 1 6 1 1 1 6 1 1 1 6 1 1 1 6 1 1 1 6 1 1 1 8 1 6 6 6 6 1 6 1 6 1 1 1 1 6 1 1
symmnumber: 1
zpe: 2724516.8 jmol-1
zpe.correction: 1.037714 hartree
zpe.thermalcorrener: 1.106228 hartree
zpe.thermalcorrenthalpy: 1.107172 hartree
zpe.thermalcorrgfe: 0.929304 hartree
zpe.sumelectzpe: -3062.170196 hartree
zpe.sumelectthermal: -3062.101682 hartree
zpe.sumelectthermalent: -3062.100738 hartree
zpe.sumelectthermalfe: -3062.278606 hartree
dipole: 6.2668 -1.7107 -2.1287
dipole: 6.8360
quadrupole: -416.7367 -368.0483 -360.6452
quadrupole: 2.7630 -2.1126 -1.2650
quadrupole: -34.9266 13.7618 21.1649 2.7630 -2.1126 -1.2650
hfenergy: -3063.2079099 hartree
pointgroup: C01 [X(C56H60O9Rh2)]
dipole: 2.4655574 -0.6730586 -0.8375103 debye
polarizability: 924.6565649|16.6513579|1047.8155223|5.0966614|4.863797|1083.6804004 unknown
InChI: InChI=1/56C.9O.2Rh.60H
charge 0 multiplicity 1
127 atoms
C  2.34653348 0.25561164 -0.27303348
Rh 0.32185958 0.02374474 -0.12428313
Rh -2.13209168 -0.09867249 0.00610488
O  -1.9903052 -1.84467387 -1.06895262
C  -0.86578359 -2.34488731 -1.31965154
O  0.25505432 -1.78429214 -1.11407217
O  -1.88847308 -1.19465498 1.71919651
C  -0.7359113 -1.40639656 2.17390448
O  0.34999412 -1.02061609 1.64719472
O  -2.20128154 1.02574715 -1.71315042
C  -1.12315026 1.36740063 -2.26099166
O  0.03930125 1.07525025 -1.85281178
O  0.15550619 1.78536781 0.90355076
C  -0.97341479 2.20294142 1.29546752
O  -2.07823902 1.6334003 1.10403601
C  3.01876945 0.87954646 0.8826985
C  3.49993251 0.2241689 2.04163671
C  3.1417109 2.28239079 0.78497184
C  4.09250291 1.01195124 3.04021533
C  3.71361711 3.03685312 1.8014753
H  2.75987855 2.78369359 -0.10846198
C  4.20109635 2.39591222 2.93942882
H  4.48293368 0.50750749 3.93007367
H  3.77741303 4.12427237 1.69930557
H  4.66277908 2.9701124 3.74828079
C  3.47531546 -1.27090142 2.24527449
H  2.4262261 -1.61003395 2.30201345
H  3.93063898 -1.4828169 3.22516671
C  3.2752691 -2.34441566 0.00415921
H  2.54418492 -3.1411084 0.23556237
C  -0.97379328 3.49753237 2.04108401
C  -1.74359759 4.57138485 1.55778815
C  -0.19681678 3.62617998 3.21034141
C  -1.7052272 5.7833778 2.25595666
C  -0.20937013 4.84956786 3.88327645
C  -0.94808486 5.9438317 3.41875791
H  -2.29087367 6.62809709 1.87733719
H  0.37931026 4.95132755 4.80154448
C  -0.63607337 -2.16742288 3.45659024
C  -1.29365546 -1.6614789 4.59999459
C  0.08994347 -3.36929179 3.51565064
C  -1.16488364 -2.35699854 5.80203511
C  0.16941386 -4.04244586 4.74137276
C  -0.43642046 -3.54965236 5.89656899
H  -1.65588438 -1.95800011 6.69649737
H  0.72421056 -4.98610744 4.78740348
C  -0.84202273 -3.7340388 -1.87347241
C  -1.51324527 -4.75572872 -1.16627285
C  -0.15397191 -4.01904263 -3.06732316
C  -1.45740107 -6.05811073 -1.66734502
C  -0.15140743 -5.3347852 -3.54210322
C  -0.78831575 -6.37034784 -2.85548084
H  -1.96063549 -6.85662296 -1.11110593
H  0.36916763 -5.55464695 -4.48037534
C  -1.19113073 2.18661457 -3.5067437
C  -1.970964 1.73297193 -4.59159148
C  -0.46671578 3.39083922 -3.58759526
C  -2.00909145 2.50746571 -5.75194436
C  -0.56030996 4.14415278 -4.76356575
C  -1.31962888 3.72151178 -5.85606184
H  -2.59864035 2.15190137 -6.60417268
H  -0.01407015 5.09149575 -4.82624443
C  0.40383219 3.89158548 -2.4676895
H  0.00084107 3.64827179 -1.47248425
H  1.40859681 3.43529994 -2.52098219
H  0.52815942 4.98488164 -2.53649099
C  -2.73427768 0.43851715 -4.5360019
H  -2.12822405 -0.38032465 -4.11073239
H  -3.63164484 0.52937741 -3.90040522
H  -3.05853721 0.13809522 -5.54569692
C  -1.40906073 4.54404657 -7.10878412
H  -2.42707564 4.95521257 -7.24012229
H  -0.70392223 5.39123315 -7.08742972
H  -1.19051823 3.93525735 -8.00401558
C  0.57120226 -2.95925228 -3.84646267
H  0.01564043 -2.00684404 -3.87333921
H  1.55641621 -2.7470697 -3.39682583
H  0.74088861 -3.28881104 -4.88445317
C  -2.28341861 -4.49284795 0.09830635
H  -1.79690207 -3.74794761 0.74571011
H  -3.28939895 -4.09801378 -0.12936626
H  -2.40892621 -5.4253768 0.67248949
C  -0.77355414 -7.7782706 -3.37609114
H  -0.41753047 -8.48535066 -2.60578053
H  -1.78951742 -8.10375326 -3.66617309
H  -0.12219649 -7.8756211 -4.26006806
C  0.74412462 -3.9938034 2.31367495
H  0.55565726 -3.43693865 1.38580942
H  1.83796663 -4.05686144 2.4516679
H  0.37796022 -5.02649937 2.1747744
C  -2.13959286 -0.41903195 4.55562981
H  -1.75228102 0.33772108 3.85661058
H  -3.16464064 -0.65858957 4.21957842
H  -2.21247219 0.0363398 5.55689856
C  -0.31451055 -4.2657885 7.21039318
H  0.30028138 -3.68383595 7.92180833
H  -1.30276925 -4.40891247 7.68215132
H  0.15654089 -5.25514435 7.08914879
C  0.61763269 2.48325317 3.74578665
H  0.02063377 1.55977588 3.83020849
H  1.46231245 2.25146149 3.07844594
H  1.01909054 2.72421196 4.74339554
C  -2.59826909 4.45219947 0.32622814
H  -2.10593132 3.87382747 -0.47246723
H  -3.54691573 3.9336916 0.55154454
H  -2.84462984 5.44995151 -0.0724236
C  -0.90376172 7.25933749 4.1410943
H  0.02615675 7.80885022 3.9014453
H  -1.75201832 7.90476611 3.85872828
H  -0.92259589 7.11859623 5.235621
O  3.96106717 -2.57910402 -1.17198524
H  3.32454932 -2.82961544 -1.86332754
C  3.05676386 0.30977663 -1.5425989
C  2.44348452 -0.1530647 -2.72780388
C  4.40131774 0.74558498 -1.62184798
C  3.12018984 -0.13414259 -3.94035455
H  1.42399271 -0.52695597 -2.67717607
C  5.0752765 0.7696797 -2.83539803
H  4.91794655 1.06801584 -0.71550756
C  4.43392103 0.33662971 -3.99921062
H  2.62161851 -0.49018336 -4.8467367
H  6.11158305 1.11732651 -2.87626333
H  4.96681214 0.35485957 -4.95508363
H  2.60818281 -1.42102892 -0.10214257
C  4.20312157 -2.07431727 1.15925939
H  5.08394414 -1.51900967 0.78934955
H  4.57557009 -3.02865896 1.5724587
