program: Gaussian 09
title: 000050350
version: EM64L-G09RevD.01
frameworkgroup: C1[X(C10H13NO2)]
method: RPBEPBE
basis: SDD
operation: Freq
keyword: #p
keyword: freq=noraman
keyword: PBEPBE/SDD
title: #p freq=noraman PBEPBE/SDD
converged: YES YES NO NO
title: Mulliken charges:
elementType: O O N C C C C C C C C C C H H H H H H H H H H H H H
charge: -0.436886 -0.254311 -0.447678 0.333922 -0.608029 0.286608 -0.393744 -0.326682 -0.355398 -0.254378 -0.233702 0.210538 -0.802365 0.212646 0.228429 0.228047 0.211406 0.226635 0.308871 0.325978 0.227648 0.228955 0.338365 0.241448 0.268005 0.235670
chargesum: 0.00000
title: Mulliken charges with hydrogens summed into heavy atoms:
elementType: O O N C C C C C C C C C C
charge: -0.098521 -0.254311 -0.121700 0.333922 -0.166953 0.286608 -0.165696 0.111359 -0.046527 -0.026730 -0.004747 0.210538 -0.057242
polarizability: 1.52773452e+02 9.99242739e+00 1.48518911e+02 -7.23814516e+00 1.02456702e+01 6.82417224e+01
1716.lowfreq: -64.7980 -10.3800 -4.2369 -0.0006 -0.0002 0.0005 6.4033 41.8613 55.6146
frequency: -64.7823 41.6180 55.5704 82.1821 97.9601 120.6895 167.6692 221.7521 284.7093 291.8264 314.6498 330.2747 357.8484 427.0287 471.3059 525.2102 540.5132 585.6851 598.9039 644.5186 646.5576 744.3608 768.1569 789.8450 812.3531 836.0432 886.6227 933.1107 950.9486 959.9869 987.3163 999.6994 1007.4069 1021.5743 1030.8885 1047.9048 1091.5073 1133.7818 1174.0780 1194.6309 1219.0517 1247.0218 1261.8053 1288.8960 1301.0700 1334.8351 1373.0006 1376.0595 1379.2026 1434.7220 1446.8585 1463.8668 1468.4304 1480.7921 1498.8963 1519.0451 1594.0947 1616.3831 1638.4059 2967.2527 2979.9269 2987.5056 3026.9027 3072.1660 3079.8005 3117.2284 3136.3116 3137.1682 3160.6904 3193.7312 3531.4883 3568.0718
redmass: 1.0539 5.9164 4.8653 3.3688 3.9507 2.2984 3.6862 3.9164 3.0023 3.0370 3.0689 1.6678 4.3303 2.9789 3.3316 3.7147 3.5693 3.1196 4.9813 1.9028 2.0197 3.9499 1.3060 2.2942 1.5397 4.0797 1.3948 6.2138 2.2691 1.8175 1.6482 1.3081 1.9235 3.8142 1.6618 2.0595 1.5476 1.2959 1.1053 1.8541 3.1246 1.3998 1.5411 1.6031 1.4685 1.3600 1.1967 1.3919 3.6964 1.8498 1.7089 1.4121 1.0468 1.1489 1.3644 1.7049 5.7395 6.0680 4.6357 1.0645 1.0660 1.0384 1.0963 1.0983 1.0992 1.0880 1.0980 1.0895 1.0983 1.0950 1.0758 1.0663
irintensity: 0.2094 1.5547 7.9318 2.1412 0.6951 7.2588 5.6166 0.3135 26.9509 10.4957 3.1533 133.4888 9.2327 4.1278 19.3859 12.0220 4.1609 0.2863 1.6643 36.8155 32.0013 0.2772 88.6365 0.8101 4.4228 1.9607 3.1719 5.5592 60.7173 45.5680 18.0683 2.8936 10.9440 32.9450 7.0390 15.1937 23.9708 13.4489 0.0550 8.7934 46.5252 18.1553 16.1069 34.2812 56.7863 9.0430 16.1676 25.8058 101.3039 200.7161 10.5721 3.9958 19.6975 3.3454 83.2504 218.4626 74.3393 3.7277 132.0003 7.5011 68.5392 7.9750 17.5100 14.3004 31.6095 11.6840 6.6575 16.9602 26.2014 9.2397 20.7612 8.7377
temp: 298.150 k
press: 1.00000 atm
elementType: 8 8 7 6 6 6 6 6 6 6 6 6 6 1 1 1 1 1 1 1 1 1 1 1 1 1
symmnumber: 1
zpe: 556726.3 jmol-1
zpe.correction: 0.212046 hartree
zpe.thermalcorrener: 0.224481 hartree
zpe.thermalcorrenthalpy: 0.225425 hartree
zpe.thermalcorrgfe: 0.172381 hartree
zpe.sumelectzpe: -593.097552 hartree
zpe.sumelectthermal: -593.085116 hartree
zpe.sumelectthermalent: -593.084172 hartree
zpe.sumelectthermalfe: -593.137216 hartree
dipole: -3.3834 1.8804 1.4166
dipole: 4.1219
quadrupole: -73.5397 -78.1804 -80.2449
quadrupole: 5.7797 0.5155 4.5404
quadrupole: 3.7820 -0.8588 -2.9232 5.7797 0.5155 4.5404
hfenergy: -593.3095975 hartree
pointgroup: C01 [X(C10H13N1O2)]
dipole: -1.4224798 -0.5065299 -0.5914371 debye
dipolederiv: -0.3467428 -0.3262739 0.1594449 -0.4102525 -0.8991926 -0.0100556 0.1935444 -0.004591 -0.5151391 -1.050304 0.1125241 -0.1019894 -0.4067112 -0.5713222 -0.1269387 -0.2373438 -0.0244052 -0.3859265 -1.5192508 0.6661868 -0.0697878 0.5879829 -0.7312253 0.013035 -0.0886185 0.066406 -0.3090063 -0.1054309 0.2479699 0.0259557 0.1528802 0.0783697 0.0266295 0.0416869 0.1210997 -0.117711 0.095833 -0.0832979 0.0182099 -0.1232413 -0.1641184 0.0490287 0.1002216 0.1760792 0.0338848 0.4083447 -0.4073889 -0.0267295 -0.6837739 0.6214635 -0.0015004 -0.0987467 0.0317283 0.0704461 0.0930839 -0.0508084 0.0431435 -0.00645 -0.0031889 0.0403613 0.0439862 0.0183323 -0.1440667 0.3777695 0.2248493 -0.0344175 0.2618266 0.7211149 0.0326539 -0.1477647 -0.1021127 0.3297743 -0.0606334 -0.0247352 0.0140366 0.1731621 -0.2347714 0.0131219 0.0570665 -0.028419 -0.1525018 -0.0997992 -0.0809805 0.0070299 -0.0501504 -0.0469637 0.0138258 0.0027555 -0.0004104 -0.1636594 0.0534558 0.0732795 0.0498567 -0.0091285 0.1088419 0.0589222 0.0421778 0.0631944 -0.1369877 2.0464224 -0.5507483 0.2288715 0.0417931 0.9278433 0.1791229 0.3904053 0.050858 0.2434499 -0.0693031 0.0906942 -0.0003683 0.222065 -0.4211867 -0.0562429 0.0186576 -0.0720512 0.0416811 0.0006353 0.0715614 0.1070313 0.037344 -0.0466158 -0.089457 0.0701265 -0.0608554 -0.0176826 -0.129506 -0.0234849 -0.1190034 0.0495307 0.05539 0.0329407 -0.0531386 0.0129224 0.0277513 -0.1260727 -0.0083986 -0.0501987 -0.0435836 0.0863545 -0.0250676 -0.0568262 -0.012956 0.1266594 -0.0442935 0.0434835 0.1189371 0.0515997 -0.0694498 -0.0928535 0.0771745 -0.0416316 -0.0375419 -0.061947 0.0046579 -0.1133872 0.0146414 0.0357864 0.0106191 -0.0886687 -0.0196064 0.0186741 0.0701418 -0.0540375 -0.0267194 -0.0238959 0.1546877 -0.0065174 -0.0234524 -0.018427 0.1723257 0.2292745 -0.0246237 -0.035019 -0.0002934 0.105707 -0.0313089 -0.0215563 -0.0587246 0.2511822 0.0184032 0.1126253 -0.0077803 0.098951 -0.0689134 -0.0195202 -0.0119654 -0.0221401 0.1602004 0.0532785 -0.0812151 -0.0319365 -0.0589884 -0.0842066 -0.0515734 -0.0299133 -0.0564675 0.1398044 0.1164572 0.0835582 -0.1451799 0.1351502 0.2928913 0.0312648 -0.1753967 -0.0229473 0.2933167 0.0394576 -0.0649051 0.0934297 -0.0176585 0.0031843 0.0527568 0.0684443 0.0823815 0.028083 -0.0762345 0.0483865 -0.0264741 -0.0177791 0.0969491 -0.0110412 -0.0395264 -0.0007177 0.1246789 0.0869603 0.0011217 -0.0769558 0.0249798 0.0525713 -0.0322059 -0.0333297 -0.0765386 -0.0816896 unknown
polarizability: 148.9291355|-10.3664557|151.8694304|10.6664874|8.8796358|68.7355199 unknown
InChI: InChI=1S/C10H13NO2/c1-8(13)11-10-5-3-2-4-9(10)6-7-12/h2-5,11-12H,6-7H2,1H3
charge 0 multiplicity 1
26 atoms
O  -2.473005 -3.147974 0.29764
O  3.212966 0.043963 0.406126
N  1.059858 -0.699113 -0.192852
C  -1.126033 0.39856 -0.37163
C  -1.799253 -0.934506 -0.671688
C  0.279652 0.492554 -0.108214
C  -1.904738 1.577133 -0.301867
C  -2.052372 -1.774419 0.60961
C  0.861327 1.746781 0.219135
C  -1.332844 2.826789 0.022949
C  0.053218 2.900966 0.283998
C  2.427359 -0.880276 0.047478
C  2.8937 -2.322825 -0.16046
H  -1.212271 -1.558061 -1.377477
H  -2.767286 -0.750386 -1.17578
H  -2.979853 1.508805 -0.510102
H  -2.790897 -1.258424 1.257239
H  -1.123271 -1.898285 1.19071
H  1.932867 1.795647 0.419164
H  0.555409 -1.538755 -0.485038
H  -1.957737 3.724947 0.068558
H  0.515217 3.861212 0.538707
H  -3.36222 -3.128305 -0.137742
H  2.382608 -3.014105 0.535334
H  3.975948 -2.370397 0.026185
H  2.695055 -2.668026 -1.192181
