program: Gaussian 09
title: 000050319
version: EM64L-G09RevD.01
frameworkgroup: C1[X(C17H20N2)]
method: RPBEPBE
basis: SDD
operation: Freq
keyword: #pfreq=noraman
keyword: PBEPBE/SDD
title: #p freq=noraman PBEPBE/SDD
converged: YES YES NO NO
title: Mulliken charges:
elementType: N N C C C C C C C C C C C C C C C C C H H H H H H H H H H H H H H H H H H H H
charge: -0.145552 -0.300980 -0.129213 -0.428863 -0.419281 -0.377447 0.484094 0.500151 -0.636334 -0.430229 -0.447100 -0.378451 -0.357417 -0.226698 -0.225551 -0.238045 -0.234511 -0.245049 -0.244681 0.237866 0.183679 0.245667 0.237889 0.178615 0.194357 0.251072 0.223048 0.227746 0.199885 0.223917 0.224528 0.261431 0.250294 0.221752 0.222345 0.222397 0.222670 0.225896 0.226102
chargesum: 0.00000
title: Mulliken charges with hydrogens summed into heavy atoms:
elementType: N N C C C C C C C C C C C C C C C C C
charge: -0.145552 -0.049908 0.108652 0.000483 -0.002776 -0.183090 0.484094 0.500151 0.014345 -0.206312 -0.222572 -0.117019 -0.107123 -0.004946 -0.003206 -0.015648 -0.011841 -0.019153 -0.018578
polarizability: 1.87820567e+02 5.96964137e+00 2.07579975e+02 7.40008287e+00 3.83678809e+00 1.73514487e+02
1716.lowfreq: -7.4745 -4.4843 -0.0005 0.0002 0.0007 3.3442 14.5552 38.1150 46.2864
frequency: 14.1903 38.0973 46.2834 50.4168 58.5635 77.8731 103.4733 138.3235 182.6341 192.3609 227.4323 250.2217 260.9114 281.7767 333.9940 341.9019 402.0470 407.0898 427.5331 444.4790 472.4011 510.0800 593.7734 607.1199 616.0665 618.7126 635.8155 700.2143 709.4378 710.4224 752.8623 758.9683 792.9790 835.7499 845.7398 852.3812 859.8789 871.4969 919.6196 928.9081 940.0581 968.2551 976.8647 983.2887 989.9435 991.2147 994.3286 1001.2576 1020.4359 1024.4506 1025.6370 1049.0702 1059.0203 1075.8518 1080.7975 1085.5346 1114.3456 1119.2829 1150.5866 1169.6310 1170.5185 1174.1574 1178.5634 1182.3103 1197.1115 1202.1569 1229.2806 1237.7930 1248.9060 1267.4725 1274.7990 1307.7506 1329.2682 1339.7280 1349.6190 1383.9594 1387.6523 1435.0092 1438.5174 1440.9811 1455.3730 1463.2607 1470.9803 1477.1219 1480.1286 1482.4879 1494.6787 1593.2989 1595.2316 1608.3612 1613.4465 2814.4948 2886.0442 2897.1303 2910.7978 3015.5429 3033.6831 3054.7189 3071.1242 3075.3802 3110.2919 3112.4867 3121.9780 3123.5817 3135.6059 3136.8464 3148.1697 3150.7080 3161.1855 3162.7852 3460.4752
redmass: 3.7898 3.7339 4.0214 4.3410 4.0809 2.4341 3.1924 3.4887 1.4593 3.0423 2.2135 4.2304 4.2645 3.2515 3.6256 4.0972 2.8105 2.8813 1.9309 3.3764 3.4170 3.2579 2.0981 4.9312 6.2944 5.9396 3.6110 1.8946 2.0985 1.7064 1.7753 2.1973 3.4865 2.7885 3.1601 1.3037 1.2597 1.3662 1.4569 2.4406 1.8656 2.9825 1.3901 1.3720 6.1418 5.9208 1.3184 1.3119 2.6366 2.1656 2.2277 1.5997 3.7018 1.7541 1.5621 1.1896 1.4015 1.3207 3.2516 1.0822 1.1012 1.8673 1.1299 1.1524 2.5855 2.2048 1.4046 1.5436 1.8677 1.8083 1.4452 1.4141 1.2971 1.3181 1.4514 6.7438 6.0999 1.1346 2.1397 2.1752 1.2147 1.0810 1.1180 2.2737 2.2277 1.1326 1.0503 6.1105 6.2563 6.1564 6.1633 1.0807 1.0548 1.0669 1.0702 1.0769 1.0864 1.0944 1.0960 1.0995 1.0872 1.0868 1.0862 1.0864 1.0916 1.0919 1.0950 1.0950 1.1011 1.1009 1.0746
irintensity: 0.2471 0.3720 0.5023 0.2300 0.0862 2.1854 1.3455 1.8418 0.4246 1.7414 0.8045 1.4340 0.4322 1.2036 4.3106 4.7557 0.2058 0.1604 6.0572 2.1810 2.7958 8.1099 102.4185 23.3487 0.7147 7.4117 18.9708 27.8547 15.3912 78.9500 45.6546 43.3531 5.5020 0.8267 1.4470 0.1411 0.4917 6.5175 0.5803 3.5959 7.6187 19.6677 0.0727 0.2267 0.1240 0.0736 0.2593 2.6538 8.0985 16.4174 7.4249 4.7135 13.3054 1.3706 18.0811 2.4421 6.0923 4.2687 12.4782 0.6593 0.9112 31.3941 3.8976 8.1132 29.1467 0.0209 11.9185 16.8891 34.1862 3.5562 0.5128 7.8894 0.3075 0.7453 32.1034 0.4017 5.6886 2.1559 2.7757 23.4071 47.2996 0.9507 4.1356 29.2221 6.9715 10.3178 21.6000 0.0663 2.5876 13.7167 1.8773 55.2260 90.1608 98.2421 84.9368 56.1707 10.4984 48.6791 37.1021 41.8055 9.7693 8.3374 0.3293 0.4607 14.3069 37.3781 14.9559 42.0406 32.7055 18.3357 0.8986
temp: 298.150 k
press: 1.00000 atm
elementType: 7 7 6 6 6 6 6 6 6 6 6 6 6 6 6 6 6 6 6 1 1 1 1 1 1 1 1 1 1 1 1 1 1 1 1 1 1 1 1
symmnumber: 1
zpe: 860025.5 jmol-1
zpe.correction: 0.327566 hartree
zpe.thermalcorrener: 0.345014 hartree
zpe.thermalcorrenthalpy: 0.345958 hartree
zpe.thermalcorrgfe: 0.279697 hartree
zpe.sumelectzpe: -767.874183 hartree
zpe.sumelectthermal: -767.856735 hartree
zpe.sumelectthermalent: -767.855791 hartree
zpe.sumelectthermalfe: -767.922052 hartree
dipole: 0.8617 0.6277 -1.1817
dipole: 1.5915
quadrupole: -110.5791 -111.6774 -102.6388
quadrupole: 5.2809 -0.6978 1.2665
quadrupole: -2.2807 -3.3789 5.6596 5.2809 -0.6978 1.2665
hfenergy: -768.2017491 hartree
pointgroup: C01 [X(C17H20N2)]
dipole: 0.2343564 -0.3384632 0.471796 debye
polarizability: 186.5396021|0.6092782|209.193953|-5.4943604|5.9771126|173.1814742 unknown
InChI: InChI=1S/C17H20N2/c1-18-16-12-19(13-16)17(14-8-4-2-5-9-14)15-10-6-3-7-11-15/h2-11,16-18H,12-13H2,1H3
charge 0 multiplicity 1
39 atoms
N  1.200137 -0.218818 -0.316362
N  4.48225 -0.670345 0.589622
C  3.319849 -0.589019 -0.279741
C  2.406258 0.661925 -0.096313
C  2.012854 -1.456329 -0.023212
C  -0.008082 0.037515 0.49503
C  -1.078534 -1.031834 0.218473
C  -0.544336 1.450427 0.21287
C  5.349111 -1.84934 0.412568
C  -1.976473 -1.415459 1.24402
C  -0.969049 2.280562 1.27794
C  -1.20841 -1.622158 -1.06319
C  -0.641175 1.934495 -1.116008
C  -2.994641 -2.362956 0.994717
C  -1.494455 3.568488 1.023963
C  -2.221855 -2.573397 -1.314119
C  -1.159566 3.221887 -1.372442
C  -3.121199 -2.945767 -0.287651
C  -1.59206 4.043231 -0.303749
H  3.652922 -0.698657 -1.326835
H  2.474199 1.057511 0.945143
H  2.512686 1.496966 -0.806651
H  1.799215 -2.315623 -0.680754
H  1.950835 -1.779229 1.043732
H  0.232828 -0.009678 1.590738
H  4.252698 -0.482779 1.57341
H  6.220903 -1.774305 1.086478
H  5.732821 -1.868806 -0.624514
H  4.848169 -2.828877 0.602918
H  -1.882214 -0.967205 2.241437
H  -0.888033 1.919014 2.31106
H  -0.501971 -1.331198 -1.848274
H  -0.296509 1.29633 -1.9368
H  -3.684314 -2.648453 1.79734
H  -1.820514 4.200312 1.858127
H  -2.311461 -3.024298 -2.309345
H  -1.228509 3.586544 -2.403878
H  -3.908546 -3.682649 -0.48323
H  -1.996325 5.042074 -0.503717
