program: Gaussian 09
title: 000050368
version: EM64L-G09RevD.01
frameworkgroup: C1[X(C16H23N3O2S)]
method: RPBEPBE
basis: SDD
operation: Freq
keyword: #p
keyword: freq=noraman
keyword: PBEPBE/SDD
title: #p freq=noraman PBEPBE/SDD
converged: YES YES NO NO
title: Mulliken charges:
elementType: S O O N N N C C C C C C C C C C C C C C C C H H H H H H H H H H H H H H H H H H H H H H H
charge: 0.178635 -0.241442 -0.431969 -0.219073 -0.225449 -0.022453 0.015646 0.187115 -0.161567 0.224017 -0.705024 -0.710728 -0.703689 -0.695133 -0.691626 -0.697941 0.514858 -0.303159 -0.370679 -0.377477 -0.342453 0.287316 0.231884 0.278139 0.299730 0.213393 0.250396 0.211226 0.246228 0.202535 0.254597 0.218434 0.210909 0.236654 0.220790 0.217365 0.198069 0.233769 0.211896 0.225618 0.260082 0.238408 0.223055 0.253329 0.355770
chargesum: 0.00000
title: Mulliken charges with hydrogens summed into heavy atoms:
elementType: S O O N N N C C C C C C C C C C C C C C C C
charge: 0.178635 -0.241442 -0.076200 -0.219073 -0.225449 -0.022453 0.247530 0.187115 -0.161567 0.224017 -0.127156 -0.035712 -0.000328 -0.029136 -0.055402 -0.026658 0.514858 -0.043077 -0.132270 -0.154423 -0.089124 0.287316
polarizability: 3.32055994e+02 7.37546019e+00 1.86409418e+02 3.54606353e+00 1.10136185e+01 1.79607957e+02
1716.lowfreq: -6.2341 -2.5031 0.0007 0.0012 0.0016 8.9962 19.8010 41.3173 45.1320
frequency: 19.5768 41.2497 45.1233 51.7188 59.4837 90.8977 105.2009 110.2634 118.7260 153.2720 169.3894 179.0660 197.1871 205.2480 221.1895 224.5528 228.3897 253.2408 255.6394 274.1675 279.5958 311.4892 342.2853 348.6202 350.0289 361.2600 374.7997 396.8251 405.7555 412.3757 421.7005 445.4228 462.5814 479.8085 499.6944 518.2437 538.3296 586.3500 593.0697 634.7893 646.0018 660.5593 712.1676 716.4872 721.8621 751.7202 794.5646 802.1867 813.5699 828.0515 862.8004 883.4598 909.7948 913.1783 921.2891 926.8015 933.5547 946.1975 946.3140 948.2505 998.9554 1022.0685 1028.9384 1034.4848 1071.2423 1103.7911 1134.6498 1146.0818 1153.1365 1168.9264 1180.8654 1192.6772 1193.6390 1215.2735 1223.6672 1228.6641 1244.2773 1250.8698 1296.1861 1314.1732 1315.2636 1352.0771 1367.3825 1371.0009 1374.7441 1382.4678 1391.3641 1397.0322 1400.2518 1432.6553 1441.8776 1448.8700 1456.5297 1460.5631 1464.9928 1469.3823 1473.3069 1476.1752 1479.6634 1492.1997 1495.4647 1504.7177 1592.2720 1600.0877 1631.4420 1647.3764 2980.8540 2981.5273 2986.2140 2987.4417 2992.6591 3036.3161 3045.9418 3075.7842 3078.3680 3079.6477 3083.9679 3086.2523 3089.0224 3089.4585 3092.3171 3115.1199 3121.8028 3121.8412 3137.8152 3147.7355 3173.7803 3180.2738 3585.1315
redmass: 5.3996 3.9974 3.5247 4.0794 5.5651 2.4251 4.1008 3.7773 6.9177 4.1633 1.1791 1.7184 2.7037 3.8007 1.4306 1.2448 1.2503 2.1315 1.1858 3.1771 2.9332 5.7178 4.2372 2.5922 1.1307 5.3134 2.6921 4.7167 3.7135 2.9850 3.2904 4.6567 3.5317 2.9207 4.1695 2.6909 6.1531 5.7368 8.3048 6.7943 5.4347 6.0239 7.1809 4.4378 5.4331 4.5622 4.0360 1.3350 5.7168 1.6576 3.1470 2.5509 1.6766 1.6923 1.5145 1.2819 1.4692 1.3347 1.2717 1.3601 3.1922 1.4220 1.7513 2.0372 2.2321 1.4565 3.0651 1.5000 2.3342 2.5953 1.1428 2.2148 1.3369 2.8428 3.0326 2.6094 3.2808 2.5586 1.5145 1.4160 1.4149 3.2806 1.2234 1.1938 1.2042 1.2232 4.4200 1.3156 1.2073 3.3373 1.1133 1.0497 1.0467 1.0478 1.0483 1.0552 1.0560 1.0555 1.0502 1.0537 1.0546 2.7738 9.2040 7.4743 6.6447 11.1061 1.0346 1.0346 1.0355 1.0368 1.0373 1.0844 1.0608 1.0990 1.1000 1.0999 1.1007 1.0972 1.0994 1.0996 1.0996 1.0989 1.0908 1.0993 1.0900 1.1053 1.0953 1.0951 1.0661
irintensity: 0.0987 0.0823 1.1725 0.7099 1.7735 0.7290 0.7032 2.3943 4.0718 0.1000 0.2399 1.8596 0.2900 0.9089 0.6801 0.4228 0.5030 1.8689 0.1898 7.6987 1.9252 2.1672 9.4293 1.8725 144.0774 0.3912 4.3505 2.5155 30.3051 1.2113 8.5855 1.0492 6.7243 11.1714 8.5953 29.4840 25.2717 6.8521 2.4969 0.7993 12.9438 3.4383 33.6467 10.5974 5.4777 2.5931 77.6390 5.5093 15.9639 41.8292 11.0204 6.4559 0.5244 0.8369 4.1927 7.9097 2.7612 0.2803 0.0988 0.8090 5.6810 4.1377 4.0425 24.6457 99.0009 33.1850 323.2830 118.7782 9.0716 181.0395 17.3553 142.4327 148.0113 12.5662 19.0584 71.8523 82.6091 94.7824 33.5034 6.0507 4.3100 326.0728 35.8992 26.5486 20.4097 27.1975 46.8619 2.8052 35.0915 31.2063 32.4992 1.2728 5.9067 0.1213 1.7399 22.8296 7.1922 11.2328 5.8176 11.6216 13.5764 273.1424 301.2663 74.7680 11.9237 400.5298 26.4609 22.8478 35.2417 30.4810 35.2932 4.7646 17.4528 26.9598 6.3357 8.8272 9.4073 35.8903 78.8804 55.8560 44.9503 5.7572 25.3771 16.3774 13.5497 1.0003 7.1471 0.9859 53.6527
temp: 298.150 k
press: 1.00000 atm
elementType: 16 8 8 7 7 7 6 6 6 6 6 6 6 6 6 6 6 6 6 6 6 6 1 1 1 1 1 1 1 1 1 1 1 1 1 1 1 1 1 1 1 1 1 1 1
symmnumber: 1
zpe: 961776.2 jmol-1
zpe.correction: 0.366321 hartree
zpe.thermalcorrener: 0.389996 hartree
zpe.thermalcorrenthalpy: 0.390940 hartree
zpe.thermalcorrgfe: 0.313414 hartree
zpe.sumelectzpe: -1334.593576 hartree
zpe.sumelectthermal: -1334.569901 hartree
zpe.sumelectthermalent: -1334.568957 hartree
zpe.sumelectthermalfe: -1334.646483 hartree
dipole: 0.4485 -1.6695 -0.2970
dipole: 1.7541
quadrupole: -132.7174 -146.5758 -127.3171
quadrupole: 1.5379 -8.8735 -0.3001
quadrupole: 2.8194 -11.0390 8.2197 1.5379 -8.8735 -0.3001
hfenergy: -1334.9598971 hartree
pointgroup: C01 [X(C16H23N3O2S1)]
dipole: 0.1538729 0.6717506 0.0361908 debye
polarizability: 332.462704|-3.3000261|188.7108399|0.4861783|9.6484278|176.8998254 unknown
InChI: InChI=1S/C16H23N3O2S/c1-11(2)19-14(17-16(3,4)5)22-10-18(15(19)21)12-6-8-13(20)9-7-12/h6-9,11,20H,10H2,1-5H3
charge 0 multiplicity 1
45 atoms
S  0.857161 1.933091 0.27321
O  -0.765585 -2.159725 -0.079456
O  -6.566652 0.405767 -0.91261
N  1.115526 -0.862996 0.507866
N  -1.11582 0.045289 0.631438
N  3.081379 0.233679 -0.213031
C  1.867257 -2.1734 0.701517
C  4.044259 1.331966 -0.522669
C  1.851741 0.311545 0.150424
C  -0.299417 -1.049275 0.303412
C  -0.512811 1.165451 1.336445
C  2.950979 -2.052115 1.790634
C  2.394258 -2.759175 -0.625846
C  4.305045 2.206034 0.736291
C  5.360944 0.624925 -0.934533
C  3.546732 2.201418 -1.711772
C  -2.497952 0.098824 0.219766
C  -2.885176 -0.303526 -1.081114
C  -3.48255 0.583078 1.117912
C  -4.233478 -0.218313 -1.478726
C  -4.829072 0.688385 0.720012
C  -5.20601 0.28528 -0.580425
H  1.0816 -2.855478 1.072517
H  -1.251056 1.95937 1.506108
H  -0.045879 0.84818 2.28226
H  3.310842 -3.066921 2.041876
H  3.805954 -1.45162 1.444391
H  2.541468 -1.597871 2.711384
H  1.564324 -2.882663 -1.341826
H  2.833205 -3.756265 -0.434198
H  3.167063 -2.106989 -1.060887
H  4.66738 1.576771 1.569501
H  5.080505 2.960234 0.509458
H  3.393407 2.732787 1.066143
H  5.193498 -0.012827 -1.820589
H  5.723538 -0.019464 -0.114119
H  6.143896 1.367433 -1.174273
H  2.644319 2.783831 -1.456826
H  4.339431 2.913587 -2.005286
H  3.31373 1.562483 -2.582559
H  -2.137631 -0.697939 -1.773637
H  -3.205446 0.85776 2.141852
H  -4.521797 -0.538636 -2.488122
H  -5.596297 1.059385 1.40532
H  -6.735817 0.083344 -1.832335
