program: Gaussian 09
title: TEXT
version: ES64L-G09RevD.01
method: RB3LYP
basis: Gen
operation: Freq
keyword: #P
keyword: Geom=AllCheck
keyword: Guess=TCheck
keyword: SCRF=Check
keyword: GenChk
keyword: RB3LYP/ChkBas
keyword: Freq
converged: YES YES NO YES
title: Mulliken charges:
elementType: P C H C H C H H C H H C H H C H H C H H C H H C H H C H H C H H C H H C H H P C H C H C H H C H H C H H C H H C H H C H H C H H C H H C H H C H H C H H Ni C K H H C O H H C C C H H H H H C C H H H H O H H Te
charge: 0.320842 -0.207628 0.158117 -0.216088 0.164834 -0.264144 0.102544 0.176281 -0.231705 0.073716 0.122256 -0.273266 0.134879 0.113349 -0.372720 0.144482 0.133565 -0.274484 0.155754 0.122336 -0.230083 0.107955 0.120612 -0.218845 0.121192 0.106396 -0.248499 0.122076 0.118828 -0.233104 0.105810 0.129350 -0.214741 0.122089 0.096248 -0.240688 0.126305 0.104196 0.247427 -0.134142 0.155618 -0.231752 0.082026 -0.209054 0.125820 0.116666 -0.281461 0.146542 0.121571 -0.283189 0.143999 0.123732 -0.403799 0.143156 0.147269 -0.273746 0.141487 0.083442 -0.226826 0.097815 0.130772 -0.217031 0.128050 0.099528 -0.225770 0.129073 0.094366 -0.231533 0.106201 0.118927 -0.218537 0.126421 0.107492 -0.235339 0.123916 0.115801 -0.194417 -0.649194 0.719763 0.167991 0.139218 -0.080544 -0.399667 0.068031 0.135783 -0.393580 -0.123950 -0.067437 0.112567 0.111147 0.116752 0.138769 0.143026 -0.119169 -0.103635 0.119002 0.128819 0.152026 0.152901 -0.274124 0.108083 0.139811 -0.310929
chargesum: 0.00000
title: Mulliken charges with hydrogens summed into heavy atoms:
elementType: P C C C C C C C C C C C C C P C C C C C C C C C C C C C Ni C K C O C C C C C O Te
charge: 0.320842 -0.049511 -0.051254 0.014681 -0.035732 -0.025038 -0.094673 0.003606 -0.001517 0.008742 -0.007595 0.002056 0.003596 -0.010187 0.247427 0.021477 -0.149726 0.033431 -0.013349 -0.015457 -0.113374 -0.048817 0.001761 0.010548 -0.002332 -0.006405 0.015376 0.004379 -0.194417 -0.341985 0.719763 0.123270 -0.399667 -0.053114 0.157844 0.180385 0.185757 0.144260 -0.274124 -0.310929
polarizability: 6.42238407e+02 -2.41258990e+01 6.23159642e+02 -3.23859707e+01 1.24456298e+01 6.47050713e+02
1716.lowfreq: -8.7020 -0.0017 0.0017 0.0030 3.1970 8.0054 18.1299 21.3916 22.4116
redmass: 5.7363 4.9368 4.4209 3.9190 5.0014 3.8247 4.5286 3.8385 3.7996 4.0738 3.2486 3.5675 3.7078 3.1896 5.3824 4.3151 4.2155 5.8847 2.8492 3.5841 2.8398 3.4400 5.1097 5.9994 7.0829 4.0437 3.0490 2.7489 8.4443 5.3860 4.1308 3.7748 3.5936 3.6391 4.1216 2.8762 2.7194 2.3887 1.3700 2.8500 2.0322 1.9572 2.4835 2.3427 2.2837 3.1063 2.1980 3.3908 2.5234 4.6464 2.0061 1.8731 2.0757 2.2601 3.8765 4.1809 4.1641 2.6680 2.5053 2.6862 3.0274 3.0829 2.7476 2.9028 2.8020 3.2175 2.8449 2.8246 3.1495 2.6937 1.7683 1.8812 1.8372 1.8653 3.2845 4.9058 2.5807 1.6704 1.1720 2.3703 2.6881 2.6448 2.7685 1.8916 1.4752 1.4777 1.4854 1.4769 3.0216 2.9086 1.3101 2.9860 3.2981 3.9564 1.5236 1.7870 1.8059 1.8538 1.9715 2.2678 2.2998 2.0824 2.0999 2.0991 2.0242 2.1509 2.0945 2.4776 2.1097 2.2464 1.9898 1.4151 1.3891 1.5024 1.4419 2.8608 1.1445 1.9935 1.9967 2.3313 2.0025 2.0802 2.6333 1.9420 1.9572 1.9230 1.9477 1.8738 1.8418 2.2052 1.6713 1.6823 2.9017 2.9943 2.8367 4.3479 1.7520 1.7966 1.6772 1.0903 1.0981 1.1450 2.0112 1.2169 1.8992 2.4805 1.7550 1.8575 1.8385 2.0919 1.3960 1.3273 1.2805 1.2743 1.3329 1.4570 1.5546 1.4587 1.4422 1.3917 1.4366 1.0647 1.3471 1.2820 1.2529 1.2794 1.1542 1.2489 1.2436 1.2544 1.2480 1.2594 1.2360 1.2276 1.2336 1.2169 1.1910 1.1119 1.2198 1.2210 1.2099 1.2072 1.1970 1.1571 1.3610 1.3406 1.3525 1.3363 1.3577 1.3495 1.2920 1.3090 1.3101 1.2142 1.3861 1.4054 1.3968 1.4136 1.4585 1.4593 1.4728 1.4460 1.4377 1.3981 1.3947 1.3857 1.2313 1.2795 1.2758 1.3869 1.0782 1.1004 1.0983 1.0705 1.0854 1.0863 1.0737 1.0809 1.0880 1.0870 1.0891 1.0867 1.0869 1.0879 1.0877 1.0461 1.0829 1.0832 1.0805 1.0905 1.0880 1.0872 1.0842 1.1033 1.0925 1.0935 1.0975 1.0941 1.0917 1.0910 1.0792 1.0682 1.0710 1.0697 1.0696 1.0693 1.0687 1.0715 1.0637 1.0645 1.0648 1.0634 1.0610 1.0764 1.0672 1.0666 1.0627 1.0782 1.0646 1.0616 1.0621 1.0354 1.0673 1.0674 1.0665 1.0641 1.0663 1.0663 1.0804 1.0864 1.0977 1.0701 1.0897 1.0858 1.0926 1.0709 1.0845 1.0898 1.0757 1.0877 1.0922 1.0999 1.0974 1.0969 1.0688 1.1020 1.0966 1.0983 1.1097 1.0999 1.1003 1.0978 1.0969 1.0981 1.0987 1.0990 1.0996 1.0988 1.0993 1.0944 1.0999 1.1058 1.0967
irintensity: 1.6301 1.5853 0.0429 0.2558 0.7869 0.3998 0.6135 0.2416 0.2158 0.8363 0.3323 0.4279 0.1370 0.1061 8.0686 1.3387 1.6993 8.1062 0.8086 0.9689 0.4875 1.2864 6.1648 5.6362 7.6516 0.8120 0.1149 0.6684 8.9506 0.8441 0.2245 0.0722 0.4158 1.3176 1.1682 0.0101 0.0174 0.4271 0.0774 0.0708 0.0428 0.2131 0.0607 0.4518 0.1480 2.1274 14.3244 3.0239 16.5458 1.4680 0.6392 0.0964 0.7609 0.7439 13.5240 9.5005 33.6006 7.5452 2.0136 1.1969 3.6046 0.4029 0.7997 0.7733 0.1990 3.0949 28.4977 22.1511 5.1081 0.3441 13.6936 3.2009 22.1715 35.1259 13.9330 49.9740 19.4578 20.6471 24.3872 8.8270 2.7604 58.3590 28.6674 69.4212 0.1558 0.2204 0.3250 0.4327 1.9671 6.9487 1.2260 3.8399 1.2415 2.1005 8.4085 16.0283 19.7900 15.0779 1.9044 36.3025 49.7443 7.1201 1.0561 4.2712 4.8556 7.1352 3.8198 31.4218 5.9992 1.8829 13.0666 5.3730 3.9314 3.4959 2.0164 0.0648 10.2558 1.4131 9.1988 3.9190 15.0855 13.9518 0.9222 2.9666 2.0711 0.8892 0.0436 2.4058 0.7835 10.4286 7.3485 0.5992 1.0165 0.1318 0.5327 156.3530 0.0955 3.0181 1.3264 1.4795 1.8051 0.5847 37.2653 5.6567 21.8952 92.1357 19.7875 7.2276 10.1254 2.4388 7.7555 38.7543 5.0261 2.9026 11.7227 10.8470 6.4918 4.1748 0.9881 2.4164 0.9831 0.3726 1.4110 1.0136 6.1090 2.5872 30.6583 0.1941 3.6701 2.3369 1.5086 1.8594 1.3020 3.3132 2.5462 0.8839 3.6201 0.4382 10.9003 1.6575 1.2283 4.2285 2.2428 2.3666 0.6682 4.6749 0.3675 0.3028 0.8646 0.3044 0.7449 0.4240 0.4129 0.3060 2.4266 4.4108 1.1528 3.0025 0.3457 0.1793 0.4904 0.2312 1.1715 0.2283 0.9316 0.1328 3.4266 16.6078 3.9583 0.4224 3.7480 2.2862 4.8868 2.2597 0.5563 1.7790 0.0042 1.4170 0.3834 7.5372 4.9676 5.9765 3.9235 1.2343 8.3974 5.8284 1.7439 20.7631 22.6766 4.3657 6.1105 6.6717 3.4992 15.3490 3.9129 7.2532 3.8552 1.3850 1.4440 6.7341 20.3824 25.7064 52.3900 35.6353 40.8503 25.0837 32.9852 16.8629 10.8564 36.8471 41.2881 45.1058 45.1640 34.6401 4.3265 13.0633 33.4402 32.3193 10.7206 34.5773 84.2884 63.6736 12.4966 23.9368 18.4016 4.5732 23.9345 7.0237 12.0316 51.8015 94.1600 12.3242 126.4414 68.4277 80.8940 109.5015 112.0030 56.4579 68.7087 63.7498 67.7813 57.7856 108.4890 51.4236 70.5905 108.3564 8.4470 33.3775 6.8790 68.8523 43.1191 27.2880 68.3261 74.0621 49.4965 25.2525 43.8295 30.1003 35.7467 41.8682 37.2219 43.4771 20.9098
temp: 298.150 k
press: 1.00000 atm
elementType: 15 6 1 6 1 6 1 1 6 1 1 6 1 1 6 1 1 6 1 1 6 1 1 6 1 1 6 1 1 6 1 1 6 1 1 6 1 1 15 6 1 6 1 6 1 1 6 1 1 6 1 1 6 1 1 6 1 1 6 1 1 6 1 1 6 1 1 6 1 1 6 1 1 6 1 1 28 6 19 1 1 6 8 1 1 6 6 6 1 1 1 1 1 6 6 1 1 1 1 8 1 1 52
symmnumber: 1
zpe: 2419970.0 jmol-1
zpe.correction: 0.921718 hartree
zpe.thermalcorrener: 0.969888 hartree
zpe.thermalcorrenthalpy: 0.970832 hartree
zpe.thermalcorrgfe: 0.834461 hartree
zpe.sumelectzpe: -4244.915202 hartree
zpe.sumelectthermal: -4244.867032 hartree
zpe.sumelectthermalent: -4244.866088 hartree
zpe.sumelectthermalfe: -4245.002458 hartree
dipole: 2.1830 -2.0194 -10.6197
dipole: 11.0282
quadrupole: -259.1139 -323.3665 -366.9769
quadrupole: -3.1590 -104.7011 -72.2432
quadrupole: 57.3719 -6.8808 -50.4911 -3.1590 -104.7011 -72.2432
hfenergy: -4245.8369196 hartree
pointgroup: C01 [X(C33H63K1Ni1O2P2Te1)]
dipole: 0.8588669 -0.7945045 -4.1780969 debye
polarizability: 642.2384074|-24.125899|623.1596421|-32.3859707|12.4456298|647.0507134 unknown
InChI: InChI=1/33C.K.Ni.2O.2P.Te.63H
charge 0 multiplicity 1
103 atoms
P  7.27952759 2.85682885 5.21929395
C  5.44761474 3.18589139 4.87037505
H  4.85909613 2.34306268 5.24968691
C  7.27765287 2.62981229 7.09887439
H  7.0662425 3.63963779 7.4635179
C  8.69059093 2.27415806 7.58688036
H  8.96385129 1.27989515 7.21625199
H  9.40813507 2.98011149 7.16199844
C  5.20792468 3.30580746 3.35776254
H  5.88440711 4.06667537 2.96185972
H  5.46472011 2.37332506 2.85039217
C  6.23509177 1.68185415 7.70429322
H  5.22561493 1.96540557 7.3969145
H  6.40135552 0.66324707 7.33721718
C  7.43968049 1.07675428 4.57794111
H  6.99652338 0.36514161 5.2780622
H  6.84561054 1.02563554 3.66454956
C  5.00022688 4.47221944 5.5819306
H  5.10383187 4.36959959 6.66392521
H  5.67320605 5.28406313 5.28594837
C  6.31738926 1.67428911 9.23817906
H  6.03678226 2.66546108 9.61391821
H  5.58970545 0.96660823 9.64791854
C  3.76283467 3.68903719 3.02069012
H  3.65161257 3.79825847 1.93712241
H  3.09145784 2.87677064 3.32359166
C  8.77146989 2.27035589 9.11631203
H  9.77730366 1.98213548 9.43679888
H  8.60553874 3.28951479 9.48390811
C  3.5564264 4.8584351 5.24272079
H  2.87481978 4.0977594 5.6417351
H  3.29935473 5.79929253 5.73889532
C  7.72738262 1.33182916 9.72890498
H  7.76848231 1.37379849 10.8215089
H  7.96378447 0.2984779 9.44601782
C  3.34513224 4.97798473 3.7319399
H  2.30134129 5.21751944 3.50867537
H  3.94632357 5.81144397 3.34883565
P  9.88672054 2.18595604 3.60630685
C  11.6444966 1.57283272 3.96300448
H  11.70476045 0.50836658 3.70830416
C  9.75885151 1.94550555 1.72410435
H  10.49685038 2.655689 1.3249743
C  8.37749963 2.39858879 1.2293513
H  7.62047606 1.70110299 1.60134173
H  8.12715929 3.3693355 1.66260839
C  11.93560677 1.7476936 5.46325776
H  11.75939327 2.79677459 5.72603576
H  11.23338066 1.16323514 6.06115446
C  10.11577773 0.57527 1.13555292
H  11.10864048 0.25757457 1.46284509
H  9.40868072 -0.17505449 1.50239254
C  8.89625866 0.70689627 4.27295663
H  8.95255255 -0.14549095 3.59255083
H  9.40309635 0.40571257 5.19040064
C  12.68644027 2.33993761 3.13678292
H  12.5274541 2.17988317 2.06671633
H  12.5533513 3.41257373 3.33375863
C  10.05708 0.60412625 -0.39917536
H  10.83874127 1.27695045 -0.77360027
H  10.28247272 -0.3876517 -0.80212529
C  13.37079418 1.35445743 5.82898065
H  13.54035401 1.53135134 6.89515209
H  13.50888522 0.27913919 5.66249489
C  8.31143998 2.43831001 -0.29948676
H  7.30996984 2.73457819 -0.62565506
H  8.99852471 3.21030662 -0.67009472
C  14.12487137 1.9495881 3.49887536
H  14.29144622 0.9015214 3.22325222
H  14.8311499 2.54387519 2.91018417
C  8.69298478 1.08389279 -0.906766
H  8.69388308 1.14097073 -1.99926945
H  7.93041871 0.3452532 -0.63287586
C  14.39380225 2.12850689 4.99464786
H  15.41058912 1.80730497 5.23899541
H  14.32901868 3.19327488 5.24714385
Ni 9.01953166 3.91010984 4.49865902
C  8.07475018 7.24848388 5.84376314
K  10.67414836 5.48989025 1.81101371
H  8.33072266 8.30825514 5.89489784
H  7.31605233 7.12019081 5.07162523
C  7.5561729 6.74318349 7.18103316
O  8.2984767 6.22202087 0.79814077
H  7.39923975 5.66481068 7.11013221
H  8.31879522 6.89099753 7.95171073
C  6.25256768 7.4243397 7.60571007
C  7.25378957 6.10279698 1.78874212
C  7.85187626 7.00159051 -0.31842742
H  6.38749011 8.5035668 7.72372664
H  5.46553806 7.27136267 6.86176897
H  5.88704898 7.03003445 8.55901703
H  7.67153979 5.54832317 2.63407786
H  6.42277644 5.53688364 1.35430296
C  6.79180816 7.47474974 2.23213061
C  7.38321629 8.37012243 0.14360069
H  7.0360355 6.47420546 -0.82843234
H  8.6943576 7.09104223 -1.00729662
H  5.94576856 7.38794269 2.91373654
H  7.60979042 7.99047982 2.75107241
O  6.34769295 8.25293856 1.11418158
H  8.23227086 8.92892866 0.56327692
H  6.97543339 8.93495773 -0.69648552
Te 9.87503442 6.17360797 5.14569942
