program: Gaussian 09
title: TEXT
version: ES64L-G09RevD.01
method: RB3LYP
basis: Gen
operation: Freq
keyword: #P
keyword: Geom=AllCheck
keyword: Guess=TCheck
keyword: SCRF=Check
keyword: GenChk
keyword: RB3LYP/ChkBas
keyword: Freq
converged: YES YES NO YES
title: Mulliken charges:
elementType: Ni P P C C H C H H C H C H H C C H C H C H C H H C H C H H C H H C H C H H C H C H H C H H C H H C H H C H H C H H C H H C H H C H H C H H C H H C H H C H H C H H C H H C H H C H H C H H C H H H H Te
charge: -0.040327 0.367709 0.397215 -0.500419 -0.146768 0.170701 -0.410187 0.154291 0.161097 -0.234660 0.172423 -0.226719 0.107281 0.113582 -0.139649 -0.193294 0.156205 -0.146581 0.108123 -0.208753 0.158939 -0.420336 0.165381 0.155722 -0.025482 0.137092 -0.262112 0.142324 0.115778 -0.249736 0.116912 0.127460 -0.285621 0.181902 -0.230695 0.114625 0.147628 -0.129783 0.110835 -0.246170 0.124710 0.140734 -0.284625 0.127003 0.142698 -0.231189 0.127097 0.109200 -0.258426 0.145678 0.119271 -0.225827 0.130930 0.104419 -0.222911 0.100787 0.127873 -0.208942 0.102495 0.126529 -0.282082 0.124468 0.157678 -0.233002 0.109307 0.127440 -0.646703 0.200474 0.155880 -0.241876 0.130500 0.112977 -0.232294 0.105684 0.128008 -0.231651 0.103127 0.128822 -0.230597 0.125102 0.102228 -0.242776 0.103442 0.126035 -0.226455 0.111146 0.127203 -0.228950 0.111463 0.128283 -0.146849 0.130296 0.137287 -0.378720 0.127486 0.118882 0.107595 0.117074 0.280626
chargesum: 0.00000
title: Mulliken charges with hydrogens summed into heavy atoms:
elementType: Ni P P C C C C C C C C C C C C C C C C C C C C C C C C C C C C C C C C C C C Te
charge: -0.040327 0.367709 0.397215 -0.500419 0.023932 -0.094799 -0.062237 -0.005856 -0.022575 -0.037089 -0.038458 -0.049814 -0.099233 0.111610 -0.004009 -0.005363 -0.103719 0.031558 -0.018948 0.019275 -0.014923 0.005108 0.006523 0.009522 0.005749 0.020081 0.000064 0.003745 -0.290349 0.001601 0.001398 0.000298 -0.003267 -0.013299 0.011895 0.010796 0.120734 -0.024757 0.280626
polarizability: 5.74832443e+02 1.32807303e+01 6.33160869e+02 -2.14699122e+01 -1.27095584e+01 6.92120447e+02
1716.lowfreq: -86.2819 -11.5673 -9.1305 -2.6957 -0.0060 -0.0050 -0.0035 22.7369 23.3007
redmass: 6.6773 4.5116 4.6146 3.9229 4.2735 4.1896 4.0309 3.9161 4.1344 3.1545 2.9698 3.4773 3.3882 2.9880 4.1262 4.9203 4.0693 5.1780 3.2912 2.6216 2.9767 3.4882 4.4508 3.0281 3.3594 3.4933 3.8087 3.4019 6.3056 4.6416 3.1133 3.3714 3.5333 2.3864 3.5216 1.9452 2.1453 2.3919 2.6735 1.6371 1.5681 3.0624 3.3981 3.2898 4.7817 2.3004 1.9208 2.0635 2.1515 3.5481 3.6251 4.1630 3.3333 3.0025 2.5246 2.8298 2.6581 2.9394 2.9255 3.0586 2.9662 3.2693 2.3586 2.5922 1.6675 1.7454 1.8181 2.2672 3.4097 6.4313 4.3036 2.5509 6.2493 1.7128 1.9802 2.4252 2.6170 1.1126 2.8194 2.6721 1.9345 1.4740 1.4781 1.4709 1.4952 3.3173 3.3182 3.3630 3.2468 1.2259 1.2238 1.6676 1.7939 1.8172 1.7931 1.9100 1.3783 2.0457 2.0632 2.0511 2.2255 1.9985 2.2299 2.0212 2.1100 1.9591 1.4293 1.4001 1.4888 1.4930 2.0081 1.8991 1.4325 2.8829 5.6410 2.0945 2.0509 2.0501 1.1630 2.0951 2.7109 1.9677 1.9920 1.9599 1.9492 2.1076 1.9108 1.8898 1.7065 1.7088 2.9119 2.9303 3.0357 2.9442 1.8419 1.7985 1.0793 1.0808 1.1016 1.0793 1.1682 1.6435 1.7552 1.9643 1.7424 1.4139 1.1101 1.2715 1.2672 1.2780 1.3286 1.3251 1.5049 1.2181 1.4628 1.3797 1.3603 1.4265 1.3548 3.4356 1.2932 1.2803 1.2820 1.2771 1.2489 1.2352 1.2387 1.2415 1.2335 1.2487 1.2231 1.2430 1.2070 1.1110 1.2030 1.2086 1.2070 1.1973 1.6187 1.3708 1.3322 1.3286 1.3494 1.3534 1.3241 1.3229 1.3386 1.2917 1.4091 1.3987 1.4270 1.3950 1.4203 1.4080 1.4503 1.4489 1.4015 1.3967 1.3951 1.3942 1.2252 2.0036 1.0787 1.0965 1.1296 1.0913 1.0870 1.0956 1.0886 1.0953 1.0897 1.0914 1.0866 1.0884 1.1051 1.1386 1.0885 1.1192 1.2153 1.1861 1.0790 1.0888 1.0909 1.0851 1.0852 1.0949 1.0978 1.0910 1.0893 4.1198 4.6499 1.0812 1.0664 1.0689 1.0702 1.0699 1.0687 1.0686 1.0655 1.0633 1.0773 1.0631 1.0615 1.0693 1.0798 1.0630 1.0646 1.0628 1.0637 1.0380 1.0646 1.0606 1.0701 1.0663 1.0715 1.0666 1.0785 1.0630 1.0965 1.0961 1.0897 1.0928 1.0941 1.0934 1.0933 1.0908 1.0781 1.0816 1.0895 1.0705 1.0865 1.0952 1.1010 1.0998 1.0982 1.0991 1.1007 1.0987 1.1018 1.1012 1.1026 1.1002 1.1009 1.0980 1.1006 1.1089 1.0851 1.0878 1.0901 1.0943 1.0913
irintensity: 60.2826 1.2309 0.1754 0.5847 0.2622 0.1027 0.4705 0.0333 0.4348 0.2091 0.0518 0.0221 0.1398 0.3800 0.3809 0.8279 5.9276 4.1298 4.3925 1.1223 0.7965 0.4852 2.3850 0.9942 0.0786 0.3698 0.3769 0.0879 2.5031 2.8236 0.3549 0.0657 2.1697 0.4617 1.2520 0.3919 0.1337 1.0341 0.2170 0.6390 0.2045 2.5799 0.7294 3.1245 4.6972 1.2904 0.2612 1.4340 4.7125 8.8942 9.2770 7.6785 15.8103 1.6093 8.7432 27.1695 9.3375 2.7161 0.3372 1.0090 0.4173 3.4706 7.1143 16.6649 13.3088 4.9398 9.6372 29.2773 0.6762 1.0724 43.4595 40.5387 39.7904 43.6229 171.6888 8.9214 18.8745 21.7310 10.4397 4.8135 35.1071 0.5570 0.2311 0.1242 0.9579 1.4449 1.7788 3.9465 0.4738 0.8048 1.0481 15.8536 9.4801 6.0648 9.8166 15.1562 24.1788 2.6277 6.1896 4.8239 1.2530 1.9281 5.6851 0.5514 3.7616 7.0712 5.5388 4.5404 6.3034 2.4711 44.7208 42.7802 2.7713 0.1494 37.9205 2.3232 3.4880 4.3286 3.8560 29.9031 0.4892 1.6597 4.9453 0.0778 0.0949 0.1781 0.5902 2.3381 2.9233 3.9456 0.4184 0.3601 0.8175 0.1905 13.3112 2.6839 0.4639 2.4942 0.1412 2.8810 5.3042 12.3265 3.3576 0.4636 13.3424 8.8332 2.5581 2.0017 1.5652 42.5878 8.0932 4.2113 24.1263 12.7834 12.7376 1.7379 3.2497 0.2669 0.0627 14.4513 0.9457 0.9978 0.2681 0.7258 2.8230 1.7855 1.9244 4.3843 2.3432 4.7603 1.5724 1.0529 2.2965 0.4846 1.7189 1.9212 3.0228 3.8589 2.6399 0.6700 1.0406 2.0308 0.5081 0.8316 0.5776 1.1327 1.1005 0.1808 1.8606 1.3167 0.1628 2.5079 2.8617 1.3812 1.2067 1.3161 0.3500 0.3724 0.1786 0.2868 5.0430 2.8027 4.7047 9.0910 12.3494 2.8336 0.1716 1.6745 5.4747 0.0314 9.7264 6.1119 3.0302 5.8253 6.4043 33.8702 17.2158 15.6964 28.9100 11.7097 6.7232 13.6947 3.7056 6.2720 3.6153 1.4695 0.9509 3.4062 0.0893 17.6865 133.5793 9.4369 26.1879 68.7234 13.8086 55.8816 38.4450 24.9180 40.7470 31.9378 0.7058 28.5560 43.1306 4.3845 10.4373 20.9742 2.8965 17.7752 5.9135 45.4120 11.8152 17.6936 32.7219 16.4698 43.0134 14.6531 54.9776 18.8080 88.4106 79.1134 115.2830 27.5500 29.8362 53.3191 132.0275 91.0386 40.9793 36.5925 52.1003 31.1308 51.5475 114.3047 54.1521 54.8004 71.9976 51.0783 51.2805 39.1901 26.3056 56.5648 43.8885 25.4945 19.8149 10.7621 24.6301 21.0830 14.0053 19.2194 11.7667 25.5388 13.7106
temp: 298.150 k
press: 1.00000 atm
elementType: 28 15 15 6 6 1 6 1 1 6 1 6 1 1 6 6 1 6 1 6 1 6 1 1 6 1 6 1 1 6 1 1 6 1 6 1 1 6 1 6 1 1 6 1 1 6 1 1 6 1 1 6 1 1 6 1 1 6 1 1 6 1 1 6 1 1 6 1 1 6 1 1 6 1 1 6 1 1 6 1 1 6 1 1 6 1 1 6 1 1 6 1 1 6 1 1 1 1 52
symmnumber: 1
zpe: 2333881.5 jmol-1
zpe.correction: 0.888929 hartree
zpe.thermalcorrener: 0.932106 hartree
zpe.thermalcorrenthalpy: 0.933050 hartree
zpe.thermalcorrgfe: 0.812309 hartree
zpe.sumelectzpe: -3568.878863 hartree
zpe.sumelectthermal: -3568.835686 hartree
zpe.sumelectthermalent: -3568.834742 hartree
zpe.sumelectthermalfe: -3568.955482 hartree
dipole: -5.4702 -1.3216 0.4645
dipole: 5.6468
quadrupole: -308.1780 -308.1454 -278.3031
quadrupole: -80.8486 -28.4855 1.7889
quadrupole: -9.9691 -9.9365 19.9057 -80.8486 -28.4855 1.7889
hfenergy: -3569.7677915 hartree
pointgroup: C01 [X(C35H60Ni1P2Te1)]
dipole: -2.152161 -0.5199721 0.1827568 debye
polarizability: 574.8324432|13.2807303|633.1608688|-21.4699122|-12.7095584|692.1204466 unknown
InChI: InChI=1/35C.Ni.2P.Te.60H
charge 0 multiplicity 1
99 atoms
Ni 1.89442224 14.09532534 5.11244673
P  0.76768166 12.23671549 5.59554785
P  0.0000789 15.17740093 4.64282175
C  3.40520974 15.01135055 4.30743962
C  3.76337414 13.9825293 3.397922
H  3.82528082 12.955725 3.73606016
C  -1.06484224 12.66455692 5.51406069
H  -1.64553382 11.79206562 5.20544253
H  -1.37082579 12.90358876 6.53306829
C  0.93861957 11.36429044 7.24874836
H  1.98522025 11.03982225 7.25215942
C  0.7756441 12.35711309 8.41202552
H  -0.24750993 12.74729942 8.42542335
H  1.43927688 13.20992337 8.26399729
C  4.16824765 15.58124965 1.62989668
C  0.94039174 10.85221576 4.33498293
H  0.14801563 10.12220875 4.53206657
C  3.91399034 16.61423959 2.53936898
H  3.97998102 17.64654951 2.21257544
C  -0.36115535 16.08259037 3.0322577
H  -1.44983045 16.09891448 2.900225
C  -1.34503477 13.85849474 4.59017972
H  -2.32326655 14.29253287 4.80476002
H  -1.37439494 13.52645759 3.55170323
C  3.53800181 16.34076329 3.84251434
H  3.30653553 17.16595208 4.50122017
C  0.15230481 17.53107064 3.03303166
H  -0.33678572 18.11448495 3.81549641
H  1.22160921 17.52923416 3.25725754
C  1.0589982 11.6830134 9.75863028
H  2.11239462 11.38198005 9.7935507
H  0.91202204 12.4012384 10.57046441
C  -0.55962984 16.37763284 5.98088111
H  0.12117884 17.22592338 5.84524823
C  -0.28989458 15.80177624 7.37956898
H  -0.93753448 14.93460558 7.54513516
H  0.73724505 15.43706036 7.43813501
C  4.08913185 14.26671833 2.07303722
H  4.31814091 13.45052048 1.39604668
C  0.04404519 10.1327407 7.45140859
H  -1.00768594 10.43692372 7.40589979
H  0.1961922 9.40536319 6.6508774
C  2.30310996 10.15484475 4.47499983
H  3.09662397 10.90667822 4.40870279
H  2.39553025 9.69212218 5.46019851
C  0.31467937 9.46407467 8.80639192
H  -0.36193717 8.61512538 8.94328971
H  1.33262802 9.0570361 8.80483405
C  -1.99987238 16.89784714 5.8834455
H  -2.19811604 17.32352841 4.89719154
H  -2.69860049 16.06453489 6.01212499
C  2.52230881 9.09458892 3.38979375
H  3.51714589 8.65408138 3.50267551
H  1.80083166 8.28052693 3.52880766
C  0.17082468 10.45315154 9.96653287
H  -0.87561794 10.7740354 10.03752164
H  0.41248199 9.96269927 10.91382151
C  0.26682799 15.29059188 1.8702034
H  1.34151335 15.19954448 2.04696814
H  -0.12926021 14.27240173 1.84105641
C  0.74822065 11.40776906 2.91306263
H  -0.25707863 11.82018265 2.80381877
H  1.44453099 12.23827546 2.76002034
C  -2.27891826 17.94524105 6.97099466
H  -1.64821254 18.82377237 6.79096947
H  -3.31647484 18.28564131 6.90339284
C  3.56323751 16.60559643 7.08253219
H  4.40183321 17.17633092 6.68345918
H  2.654816 16.90124974 6.55891406
C  -0.5653923 16.84063634 8.47055831
H  -0.39572132 16.39925466 9.45699671
H  0.15021653 17.66422761 8.37046426
C  0.9793876 10.34058711 1.83789143
H  0.20143719 9.57121354 1.91358645
H  0.87787425 10.7928151 0.84700032
C  -1.99067067 17.39368677 8.3710953
H  -2.70329286 16.58993208 8.59247845
H  -2.15142777 18.17041103 9.12428379
C  0.03232666 15.97483502 0.51946465
H  0.52367432 15.40106002 -0.27175858
H  -1.04038883 15.97586472 0.28989474
C  -0.07557427 18.21213168 1.67753605
H  -1.15360234 18.31282523 1.50207967
H  0.33287557 19.22693373 1.70374337
C  0.54980281 17.4149735 0.53029083
H  1.63776392 17.39954885 0.65387461
H  0.34411207 17.90271574 -0.42710274
C  2.35248009 9.68246644 1.98730003
H  3.13284459 10.43253639 1.8128956
H  2.48747132 8.90517987 1.22973635
C  3.41110338 16.82590917 8.58150534
H  2.56052087 16.24770938 8.95345566
H  4.29314085 16.45208988 9.1105938
C  3.21161886 18.30648803 8.91465634
H  3.05165457 18.45454877 9.98603813
H  4.08284244 18.89913263 8.62265577
H  2.34410219 18.71567045 8.38975344
H  4.44909529 15.80527289 0.60823489
Te 3.87449063 14.50211552 6.55762362
