program: Gaussian 16
title: TEXT
version: ES64L-G16RevB.01
method: RB3LYP
basis: TZVP
operation: Freq
keyword: #P
keyword: Geom=AllCheck
keyword: Guess=TCheck
keyword: SCRF=Check
keyword: GenChk
keyword: RB3LYP/TZVP
keyword: Freq
converged: YES YES YES YES
title: Mulliken charges:
elementType: Ni P P C C H C H H C H C H H C C H C H C H C H H C H C H H C H H C H C H H C H C H H C H H C H H C H H C H H C H H C H H C H H C H H C H H C H H C H H C H H C H H C H H C H H C H H C H H C H H H H Se
charge: -0.120103 0.347493 0.383955 0.034866 -0.304106 0.163051 -0.408544 0.152825 0.157163 -0.239839 0.166578 -0.247314 0.109252 0.130727 -0.168557 -0.198009 0.155112 -0.126113 0.112877 -0.216306 0.159456 -0.432814 0.160102 0.154909 -0.101369 0.128584 -0.255535 0.141814 0.112746 -0.242763 0.114041 0.126231 -0.269005 0.177216 -0.260276 0.116624 0.151500 -0.076650 0.117505 -0.242642 0.124254 0.139979 -0.265449 0.112831 0.140360 -0.230167 0.126515 0.108080 -0.260759 0.144699 0.118917 -0.226402 0.129571 0.104521 -0.223405 0.100449 0.127314 -0.228230 0.117099 0.126791 -0.284789 0.123847 0.160853 -0.230540 0.107914 0.126942 -0.258197 0.145386 0.128884 -0.235398 0.129067 0.110413 -0.230981 0.104521 0.127001 -0.230551 0.103121 0.128245 -0.228901 0.124470 0.101951 -0.241866 0.103491 0.125303 -0.226763 0.109781 0.126735 -0.231203 0.110372 0.127574 -0.219135 0.127445 0.131547 -0.378156 0.110304 0.130254 0.120168 0.115000 -0.115758
chargesum: -0.00000
title: Mulliken charges with hydrogens summed into heavy atoms:
elementType: Ni P P C C C C C C C C C C C C C C C C C C C C C C C C C C C C C C C C C C C Se
charge: -0.120103 0.347493 0.383955 0.034866 -0.141055 -0.098555 -0.073262 -0.007334 -0.053557 -0.042897 -0.013237 -0.056850 -0.117803 0.027216 -0.000975 -0.002491 -0.091788 0.007848 0.040855 0.021590 -0.012258 0.004428 0.002857 0.007690 0.004358 0.015660 -0.000090 0.004316 0.016073 0.004082 0.000541 0.000815 -0.002480 -0.013073 0.009752 0.006744 0.039857 -0.017430 -0.115758
chargesum: 0.00000
polarizability: 5.55579406e+02 1.23824897e+01 6.23358455e+02 -3.48625433e+01 -1.18861666e+01 6.74785679e+02
1716.lowfreq: -129.7235 -8.2113 -4.6981 -0.0068 -0.0065 -0.0062 4.4977 21.6707 24.6792
redmass: 7.6795 4.7435 4.2104 3.9983 4.4076 3.8624 3.8471 3.8882 2.9668 4.3205 3.4997 3.2216 3.3738 3.8297 4.7475 3.4563 3.8715 2.6612 5.5499 3.5531 2.1103 3.1997 4.3892 3.4492 3.3413 3.7319 3.8447 4.3691 4.4963 5.0487 2.9983 3.4169 2.4410 2.5679 2.2143 1.9686 3.0153 1.4281 1.9356 3.2548 2.6520 2.8076 3.1789 3.6961 5.3479 2.3157 1.9347 2.0689 2.1712 3.5555 3.7286 4.1638 3.5167 3.1128 2.9365 2.6091 2.4886 3.0095 2.9197 3.0656 2.9231 3.2387 2.3746 2.6376 1.6627 1.7489 1.7969 2.2264 6.4805 4.5383 2.5364 5.3488 3.6846 2.3556 1.6490 2.4683 2.6222 2.7929 2.7014 1.0914 1.2716 1.8977 1.4801 1.4710 1.4697 1.4894 3.3229 3.3435 3.3418 3.2639 1.3537 1.2026 1.6772 1.8139 1.8042 1.7846 1.9254 2.0839 2.0777 2.0543 2.2331 2.1770 2.0307 2.0158 2.0507 1.9149 1.4100 1.3945 1.4880 1.4876 1.4267 1.9287 1.8402 2.8944 6.4193 2.0710 2.0642 2.0607 2.0862 1.3521 1.9651 1.9541 1.9887 2.1704 1.9524 1.9451 1.8986 1.8880 1.6978 1.6994 2.9247 2.9239 3.0008 2.9660 1.7647 1.0771 1.0788 1.8920 1.0967 1.0814 1.1745 1.6518 1.7444 1.9581 1.7383 1.3934 1.1034 1.2740 1.2719 1.1800 1.3319 1.3307 1.5228 1.4799 1.2756 1.3846 1.3702 1.4161 1.3393 1.2832 1.3182 1.2919 2.5548 1.2734 1.2484 1.2413 1.2386 1.2382 1.2446 1.2526 1.2269 1.2434 1.2068 1.1060 1.2081 1.2097 1.2030 1.2076 1.9192 1.3348 1.3361 1.3653 1.3715 1.3554 1.3135 1.3063 1.3132 1.2900 1.3904 1.4104 1.4284 1.4255 1.4276 1.4054 1.4603 1.4519 1.4042 1.3997 1.3981 1.3939 1.2263 2.0126 1.0769 1.0970 1.2551 1.2966 1.1226 1.1185 1.1073 1.0879 1.1045 1.0903 1.0900 1.0938 1.0893 1.0771 1.0973 1.0797 1.0810 1.0814 1.0873 1.0548 1.0847 1.0787 1.0911 1.0917 1.0951 1.0924 1.0894 4.2603 4.6536 1.0803 1.0661 1.0702 1.0717 1.0689 1.0686 1.0686 1.0756 1.0651 1.0642 1.0680 1.0649 1.0693 1.0740 1.0640 1.0628 1.0648 1.0649 1.0638 1.0357 1.0688 1.0661 1.0722 1.0609 1.0683 1.0749 1.0628 1.0620 1.0966 1.0896 1.0953 1.0900 1.0913 1.0921 1.0820 1.0898 1.0698 1.0998 1.0994 1.0977 1.0990 1.0981 1.0996 1.0991 1.0987 1.1007 1.0972 1.1022 1.0970 1.1025 1.1026 1.1013 1.1007 1.1005 1.1085 1.0857 1.0886 1.0903 1.0929 1.0919
irintensity: 86.0265 0.4265 0.0452 0.4842 0.2133 0.3271 0.0700 0.0261 0.0487 0.4138 0.0130 0.2576 0.0716 0.4207 0.2059 1.8694 3.3231 2.7493 0.3391 0.3278 0.6968 0.5461 2.3587 0.7119 0.7818 0.6278 1.1031 2.1869 0.4728 3.0135 0.0678 0.1622 0.0202 0.2928 0.4870 0.0481 4.6507 1.4062 2.1090 1.3016 0.4248 1.5495 1.2368 1.2147 3.7814 1.3305 0.2180 1.4931 4.5450 11.6083 10.2358 9.3016 27.6193 1.2172 28.9065 4.5160 5.7895 0.8044 0.5278 1.5292 0.8747 3.8964 8.9093 18.2362 15.6025 3.8724 11.4241 29.8787 2.4807 48.3547 43.1269 42.9545 0.1823 10.3125 220.5569 2.8004 17.0952 11.8177 10.8755 12.1148 8.1271 32.3956 1.2193 0.1769 0.1906 0.7485 1.9705 1.1922 4.3672 0.4063 22.3561 1.0673 16.9465 5.5025 5.0173 10.4711 14.3727 2.1920 5.9493 7.1489 1.9737 5.8948 0.9769 0.2425 4.7449 9.3038 3.9583 5.0324 5.4971 2.7679 12.3527 67.3954 33.8021 0.0730 32.2693 1.0290 1.0916 4.1223 31.9493 2.9229 2.2093 1.3374 4.9328 0.7926 0.0356 0.1595 0.7666 2.0021 3.7834 3.5390 0.3874 0.3698 0.7303 0.2193 11.7081 0.5611 1.6711 4.1793 0.0652 3.0245 6.1236 11.5468 4.1093 0.4708 13.2771 8.8371 3.0420 1.2768 2.8053 14.3807 11.1006 2.7845 14.6108 13.4618 29.6078 1.2172 3.6330 2.5879 0.2371 0.1825 0.3536 0.8220 16.2341 0.7898 2.8004 2.1626 1.6096 3.8088 3.2155 4.4173 0.8988 0.4797 2.4673 0.2393 1.3414 2.8815 2.9987 4.0154 4.1770 0.5880 1.3916 0.9383 1.2906 0.4733 0.9978 1.2354 0.7000 0.1193 2.7063 2.6909 1.3898 0.1259 1.8401 1.0922 0.9494 0.9117 0.3850 0.4299 0.3054 0.1438 4.1376 3.7146 4.1990 8.6998 32.0793 23.5873 9.1051 5.1035 4.8506 2.0874 2.3323 11.6566 4.2547 2.1682 1.1926 21.8297 16.5308 10.5006 1.1642 11.5821 10.1741 6.8535 3.7379 5.4310 2.6439 3.4523 2.1430 2.9282 0.9089 31.6399 105.6664 8.5089 23.9707 21.6935 22.5953 78.1518 53.9071 22.6798 8.4648 41.1272 30.9637 19.7973 61.2350 0.8970 12.3901 19.0788 18.5248 2.7903 1.3531 7.6087 35.8440 44.7361 19.8780 43.7294 14.1947 7.9287 62.7181 17.5367 31.5955 71.2829 81.3950 93.7489 70.4150 59.9937 143.7574 61.8477 84.6107 55.6014 77.0446 44.6249 59.1809 44.7759 63.7585 44.7470 92.8986 34.1533 54.3182 10.3786 41.0585 43.7650 30.4796 50.1209 48.8181 0.3940 27.3076 24.3747 10.6719 22.7197 15.4795 15.2072 12.0589
temp: 298.150 k
press: 1.00000 atm
elementType: 28 15 15 6 6 1 6 1 1 6 1 6 1 1 6 6 1 6 1 6 1 6 1 1 6 1 6 1 1 6 1 1 6 1 6 1 1 6 1 6 1 1 6 1 1 6 1 1 6 1 1 6 1 1 6 1 1 6 1 1 6 1 1 6 1 1 6 1 1 6 1 1 6 1 1 6 1 1 6 1 1 6 1 1 6 1 1 6 1 1 6 1 1 6 1 1 1 1 34
symmnumber: 1
zpe: 2333888.3 jmol-1
zpe.correction: 0.888931 hartree
zpe.thermalcorrener: 0.931960 hartree
zpe.thermalcorrenthalpy: 0.932905 hartree
zpe.thermalcorrgfe: 0.812880 hartree
zpe.sumelectzpe: -5962.384929 hartree
zpe.sumelectthermal: -5962.341900 hartree
zpe.sumelectthermalent: -5962.340956 hartree
zpe.sumelectthermalfe: -5962.460980 hartree
dipole: -4.6366 -0.7915 0.8768
dipole: 4.7847
quadrupole: -303.5751 -292.7445 -272.1415
quadrupole: -67.7593 -22.5921 11.0305
quadrupole: -14.0881 -3.2575 17.3456 -67.7593 -22.5921 11.0305
hfenergy: -5963.2738601 hartree
pointgroup: C01 [X(C35H60Ni1P2Se1)]
dipole: -1.8241838 -0.3114017 0.3449404 debye
polarizability: 555.5794064|12.3824897|623.358455|-34.8625433|-11.8861666|674.7856785 unknown
InChI: InChI=1/35C.Ni.2P.Se.60H
charge 0 multiplicity 1
99 atoms
Ni 1.89871669 14.14615588 5.10936781
P  0.81718153 12.25985927 5.56674742
P  0.00539925 15.21669829 4.66453669
C  3.46072825 15.05032629 4.38137271
C  3.81399892 13.95106262 3.55741555
H  3.93009507 12.96209236 3.97979996
C  -1.01971159 12.6841434 5.5339287
H  -1.60481104 11.81241789 5.23098376
H  -1.29871824 12.91108094 6.56348419
C  1.01888082 11.39154814 7.22072297
H  2.05644089 11.04018842 7.19489401
C  0.91709232 12.40109982 8.37658073
H  -0.09410591 12.82044774 8.41259716
H  1.59731425 13.23496858 8.19699505
C  4.14192003 15.42681555 1.66741848
C  0.9443416 10.86312124 4.31278467
H  0.14591136 10.14519684 4.52985361
C  3.91679012 16.52630908 2.50926816
H  3.97161999 17.53157634 2.10587846
C  -0.36812231 16.10305198 3.04565954
H  -1.45782842 16.13695185 2.92630684
C  -1.33192626 13.88623607 4.63113655
H  -2.30732497 14.31039533 4.87759318
H  -1.38737059 13.56433825 3.59054662
C  3.58998858 16.35076634 3.83994315
H  3.37974543 17.21537765 4.45348388
C  0.17272127 17.54136704 3.02321826
H  -0.29431378 18.14274278 3.80571793
H  1.24489872 17.52044502 3.23433987
C  1.21973061 11.7367576 9.72381268
H  2.26585372 11.40943899 9.73506106
H  1.11179109 12.46769317 10.53069734
C  -0.57897086 16.42372713 5.98801519
H  0.11355325 17.26595893 5.87428679
C  -0.34942455 15.83445624 7.38821512
H  -1.01352827 14.9753571 7.53114061
H  0.67042426 15.45346812 7.46589021
C  4.09332939 14.14777124 2.20265074
H  4.31664748 13.28930598 1.57836353
C  0.10179693 10.18472035 7.46533407
H  -0.94326779 10.51349984 7.44804415
H  0.21230559 9.44554266 6.66851669
C  2.29807956 10.14414171 4.42326295
H  3.10219896 10.88162254 4.32993909
H  2.4080439 9.6861227 5.40892646
C  0.39692077 9.52535168 8.81977223
H  -0.29361214 8.69316404 8.98673688
H  1.40554283 9.09621591 8.79428211
C  -2.01062728 16.96095145 5.86155074
H  -2.18011148 17.39932881 4.87558987
H  -2.72106577 16.13401824 5.96421175
C  2.47145689 9.07391737 3.33937396
H  3.46037436 8.6152028 3.43043395
H  1.73817587 8.27453005 3.50026446
C  0.30809856 10.53132989 9.97088819
H  -0.72808559 10.87864481 10.06511523
H  0.5634529 10.04673854 10.91774111
C  0.23255915 15.28708974 1.88608107
H  1.30697421 15.17521668 2.05518068
H  -0.18397757 14.2770822 1.87116352
C  0.72907342 11.41664761 2.89373969
H  -0.27100285 11.84705401 2.80707944
H  1.43608461 12.23480018 2.72320454
C  -2.30470526 18.0011815 6.95228254
H  -1.66119704 18.87482548 6.79465177
H  -3.3370224 18.3528314 6.86409523
C  3.46348638 16.56829446 7.03990512
H  4.31685602 17.1426318 6.67582822
H  2.56118049 16.91300455 6.5361242
C  -0.6367517 16.86777787 8.48117248
H  -0.49319742 16.41826078 9.46826006
H  0.08901584 17.68482132 8.40174974
C  0.91553974 10.34167698 1.8176763
H  0.12551348 9.5872724 1.91540368
H  0.79960874 10.79118713 0.82705087
C  -2.05401173 17.43556498 8.353926
H  -2.77867264 16.63644208 8.55171589
H  -2.22499372 18.20739195 9.10992583
C  -0.00105765 15.96029749 0.52971763
H  0.4726093 15.36879189 -0.25935833
H  -1.07562003 15.97771547 0.30982068
C  -0.05819147 18.21209701 1.66310748
H  -1.13624015 18.32922596 1.49807295
H  0.36805709 19.21989022 1.67296681
C  0.54076191 17.39142471 0.51832424
H  1.62982756 17.35971264 0.63010835
H  0.33262061 17.87135063 -0.4425493
C  2.27898369 9.65797899 1.93822064
H  3.0689828 10.39253707 1.74240482
H  2.38174973 8.87491786 1.18147404
C  3.32238211 16.69740278 8.55082303
H  2.45742983 16.12035679 8.8883321
H  4.19744811 16.26392651 9.04432027
C  3.16781694 18.1582574 8.97881034
H  2.30357118 18.62243263 8.49632784
H  3.02847736 18.23984907 10.05973236
H  4.05099615 18.74438395 8.71072939
H  4.38440468 15.57896794 0.62300392
Se 3.72312932 14.66608299 6.49483185
