program: Gaussian 16
title: TEXT
version: ES64L-G16RevB.01
method: RB3LYP
basis: TZVP
operation: Freq
keyword: #P
keyword: Geom=AllCheck
keyword: Guess=TCheck
keyword: SCRF=Check
keyword: GenChk
keyword: RB3LYP/TZVP
keyword: Freq
converged: YES YES NO YES
title: Mulliken charges:
elementType: C H H C H H C H H H K O C C H H C C H H H H O H H Se
charge: -0.247502 0.074499 0.125815 -0.182263 0.125600 0.103615 -0.381833 0.102264 0.113158 0.122614 0.843585 -0.411937 -0.096971 -0.071573 0.124362 0.123044 -0.074132 -0.133759 0.125273 0.159158 0.140324 0.101340 -0.279743 0.124416 0.154930 -0.784286
chargesum: -0.00000
title: Mulliken charges with hydrogens summed into heavy atoms:
elementType: C C C K O C C C C O Se
charge: -0.047189 0.046951 -0.043796 0.843585 -0.411937 0.150436 0.212859 0.167531 0.145588 -0.279743 -0.784286
polarizability: 1.35208595e+02 4.15064553e+00 1.72416964e+02 -3.18156909e+00 -8.05066806e+00 1.69899868e+02
1716.lowfreq: -16.6926 -9.2010 -0.0094 -0.0010 0.0075 11.6586 27.5971 32.6081 48.5064
frequency: 23.7163 32.3406 47.8061 56.2317 64.4980 76.7190 96.0502 133.6440 134.5581 144.8094 217.9185 241.2492 264.4096 288.9065 304.5208 433.4189 451.4645 485.8129 627.3084 635.5812 739.2643 832.7216 841.0346 865.0039 875.5295 898.1128 901.1751 1018.8683 1029.4767 1030.0989 1064.1898 1090.9219 1099.4182 1108.6264 1121.8462 1148.1680 1227.7468 1242.6603 1249.9740 1289.2900 1321.9473 1328.3267 1342.9575 1357.6529 1374.5643 1407.5656 1411.1101 1422.1520 1437.5398 1480.0516 1480.6366 1489.1764 1490.5031 1495.4483 1496.5307 1504.6898 1505.7395 2977.2373 3004.1687 3007.7920 3010.5256 3014.2416 3017.9747 3027.6928 3049.9039 3066.7578 3077.2110 3080.1151 3081.8220 3085.0613 3092.7782 3109.7004
redmass: 6.1437 4.3548 4.6413 4.7041 7.6535 3.9730 1.6042 11.0732 4.1106 5.2670 3.5498 1.1181 1.7825 2.9368 3.9036 2.0228 6.2389 2.6770 1.6795 3.6496 1.0985 4.0317 1.2034 2.0334 2.6332 2.0889 2.5492 2.3786 1.1769 2.6123 2.2609 4.1077 1.9105 2.2565 4.7770 2.1206 1.2685 1.4071 1.0665 1.1487 1.1051 1.2280 1.1626 1.3878 1.2029 1.2729 1.2297 1.2790 1.3804 1.0789 1.0875 1.0842 1.0691 1.0598 1.0766 1.0833 1.0901 1.0710 1.0649 1.0661 1.0576 1.0485 1.0568 1.0633 1.0957 1.1009 1.1007 1.1053 1.0998 1.1040 1.0942 1.0978
irintensity: 10.3165 4.5169 4.6353 0.5970 9.4373 0.7941 0.1744 13.6439 10.8484 15.9648 1.1612 0.0120 3.3565 28.9616 0.2649 0.3779 0.4097 0.1573 20.3484 4.9419 10.9144 5.4887 0.3299 19.6727 70.9933 4.5222 41.8531 0.4598 4.5902 0.8974 10.0929 122.9193 5.5199 9.1213 136.0475 0.8583 54.7059 2.0448 0.0432 32.0777 0.7684 15.6646 1.2149 1.8994 0.6258 16.5277 5.7938 2.7893 0.0867 4.2405 1.3037 1.8812 0.8947 13.7424 8.9978 5.2510 7.3055 47.6024 31.7885 42.9881 26.8919 66.5618 105.8426 21.8360 6.9341 6.1499 57.7821 9.7144 44.4934 116.0014 36.2107 20.5641
temp: 298.150 k
press: 1.00000 atm
elementType: 6 1 1 6 1 1 6 1 1 1 19 8 6 6 1 1 6 6 1 1 1 1 8 1 1 34
symmnumber: 1
zpe: 571125.1 jmol-1
zpe.correction: 0.217530 hartree
zpe.thermalcorrener: 0.232400 hartree
zpe.thermalcorrenthalpy: 0.233344 hartree
zpe.thermalcorrgfe: 0.171244 hartree
zpe.sumelectzpe: -3427.749894 hartree
zpe.sumelectthermal: -3427.735024 hartree
zpe.sumelectthermalent: -3427.734080 hartree
zpe.sumelectthermalfe: -3427.796181 hartree
dipole: 1.1294 -4.4610 11.7918
dipole: 12.6579
quadrupole: -70.3253 -140.8921 56.5832
quadrupole: -31.2041 110.0501 32.4266
quadrupole: -18.7805 -89.3474 108.1279 -31.2041 110.0501 32.4266
hfenergy: -3427.9674243 hartree
pointgroup: C01 [X(C7H15K1O2Se1)]
dipole: 0.4443369 -1.7550968 4.6392493 debye
dipolederiv: 0.0417157 0.2527921 -0.0162313 0.0943646 0.3327674 0.0149068 -0.023273 0.1466186 0.0670783 0.0219378 -0.0547836 -0.0987399 -0.0581144 -0.1161415 -0.0770579 -0.0702259 -0.070465 -0.2119561 -0.1838516 -0.082196 0.0415531 -0.1093437 -0.0799971 0.0101915 0.0527485 0.0021416 0.0322892 0.0952058 -0.1896742 -0.0581376 0.0628975 0.0254256 0.0443109 -0.0466039 -0.100276 0.1221523 0.0464444 -0.0068086 -0.0125806 -0.0182949 0.0297964 -0.0417337 -0.0317916 0.0129533 -0.154487 -0.1623725 0.0137701 0.1012108 -0.0296609 0.0052993 -0.003801 0.0844271 -0.0108615 0.0279691 0.1334484 0.0220664 -0.0077469 -0.0851667 -0.1159501 -0.0180217 -0.0270634 0.0236295 0.1812608 0.0526244 -0.0214611 -0.0382516 0.0015685 0.0390574 0.0090291 -0.0355353 -0.0473571 -0.2088268 -0.1516799 -0.05594 0.092516 0.0273237 0.0494635 -0.0215447 0.1076123 0.0044399 0.0062773 0.0041259 0.0910427 -0.0477697 0.0458157 -0.2253428 0.0541284 -0.0346077 0.0595343 0.0486426 0.8157692 -0.0610174 -0.0526143 -0.0556003 0.9580941 0.0382603 -0.0412986 0.0144526 0.8573339 -0.5765081 0.0863439 -0.1077516 0.100846 -0.7544723 0.007399 -0.0781627 0.0447463 -1.1822329 0.3621336 -0.0145911 -0.0623246 0.0185645 0.2668995 0.2054968 -0.0242312 0.0349608 0.8858448 0.486732 -0.1041008 0.1855695 -0.0908417 0.3508325 -0.4067572 0.0998627 -0.2047087 0.3208768 0.0022964 0.1015178 -0.1004454 0.0710052 -0.0468372 0.102169 -0.0441761 0.0424764 -0.0422062 -0.158904 -0.051208 0.1284283 -0.0211334 0.0324896 -0.0423323 0.0131854 -0.012522 -0.0442096 0.4910338 -0.1083932 0.1886077 -0.1326272 0.3993408 -0.324953 0.1058717 -0.110437 0.5139068 0.3027755 -0.006333 -0.1140339 0.0256724 0.2636355 0.2591221 -0.0015377 0.0751263 0.8615732 -0.1729818 -0.0017137 0.0128234 -0.0139235 0.0046984 0.0624733 0.1077427 0.0322698 0.0076132 0.0812045 0.0034683 -0.0528912 -0.0358684 0.0610502 0.0429537 -0.0814602 0.0609865 0.0804891 0.073238 0.0291276 0.0322252 0.0025131 0.0351297 -0.0614438 -0.0124211 -0.0430154 -0.1570324 -0.2001428 -0.0016295 -0.015447 0.0025434 -0.0064994 0.0605157 0.101842 0.0297269 0.0190977 -0.544569 0.0594937 -0.1456454 0.086212 -0.6808036 0.0449692 -0.1040415 0.0181993 -1.1651038 -0.1571189 -0.0275383 0.1310334 -0.0167964 0.0366747 -0.0373873 -0.0189044 -0.0196681 -0.0100759 0.0382682 0.0690499 -0.0811125 0.0460645 -0.0079472 0.0748151 -0.0563561 0.0405009 -0.0214804 -0.7408251 0.0587161 0.0977562 0.0819804 -0.8566634 0.0042916 0.058398 -0.0234522 -0.8347941 unknown
polarizability: 135.2085951|4.1506455|172.4169637|-3.1815691|-8.0506681|169.8998678 unknown
InChI: InChI=1/7C.K.2O.Se.15H
charge 0 multiplicity 1
26 atoms
C  9.47541132 7.70480224 5.04663595
H  9.59257036 7.73394735 6.13433748
H  10.47834755 7.6518439 4.61858399
C  8.77764031 8.97698456 4.57737462
H  8.63998867 8.92720181 3.49380421
H  7.77195396 9.01772692 5.00682528
C  9.5527978 10.24582828 4.94297766
H  9.69541958 10.33209799 6.02466239
H  10.54416464 10.24886804 4.48067549
H  9.02820442 11.14495653 4.60747728
K  8.77277371 4.68413538 7.40895769
O  7.57040725 6.74829077 8.70105819
C  7.51165333 7.18428737 10.06647985
C  6.82355093 7.64351452 7.84421618
H  8.13096379 6.50107052 10.65158436
H  6.47697629 7.11950192 10.42580039
C  8.01816555 8.61019369 10.19304511
C  7.3362004 9.06101279 7.9947886
H  5.7626655 7.59117642 8.11653423
H  6.95187069 7.28457133 6.82074062
H  7.90508674 8.9639903 11.21916472
H  9.08393909 8.64838111 9.92408728
O  7.2705348 9.48983965 9.35926802
H  8.37053474 9.12385204 7.63534051
H  6.7236158 9.75045925 7.41376822
Se 8.50411177 6.02578332 4.52086769
