program: Gaussian 16
title: TEXT
version: ES64L-G16RevA.03
method: RB3LYP
basis: TZVP
operation: Freq
keyword: #PGeom=AllCheck
keyword: Guess=TCheck
keyword: SCRF=Check
keyword: GenChk
keyword: RB3LYP/TZVP
keyword: Freq
converged: YES YES YES YES
title: Mulliken charges:
elementType: C C C C H C H C H H H S C H H C H H C H H H
charge: -0.156080 -0.109903 -0.074491 -0.114143 0.141169 -0.122897 0.159553 -0.147643 0.125173 0.124426 0.127187 0.012713 -0.325089 0.153269 0.153866 -0.199785 0.125549 0.125570 -0.368222 0.116766 0.116858 0.136157
chargesum: -0.00000
title: Mulliken charges with hydrogens summed into heavy atoms:
elementType: C C C C C C S C C C
charge: -0.156080 0.031266 0.085062 0.011029 0.001529 -0.020457 0.012713 -0.017954 0.051334 0.001558
chargesum: 0.00000
polarizability: 1.12967040e+02 -6.60861815e+00 1.43628018e+02 -4.45801131e+01 -1.67364817e+01 1.79245926e+02
1716.lowfreq: -0.0025 -0.0021 0.0011 3.5918 7.6517 12.3911 22.7166 83.8380 92.9622
frequency: 22.5224 83.8369 92.9383 121.0300 180.7811 255.1864 258.2129 275.8648 386.0691 407.5386 449.7562 472.2506 634.0270 658.9192 708.1643 736.5494 750.8055 777.6126 841.8185 889.5846 893.9041 916.1712 961.3204 970.3927 1015.1606 1042.6618 1050.7174 1077.1273 1103.4029 1110.1029 1120.2719 1195.1264 1222.3235 1254.4681 1282.3552 1313.2151 1337.0914 1365.5971 1385.9335 1422.2174 1474.4854 1490.8449 1495.5880 1500.5279 1509.3680 1518.6323 1612.6546 1627.9591 3025.8040 3031.7677 3044.0048 3059.6036 3087.1500 3094.4867 3102.1876 3165.9600 3172.5308 3182.0001 3195.6047 3213.4550
redmass: 4.4933 1.6195 3.9680 2.6795 4.5903 1.3364 2.4538 4.3997 3.8608 3.0049 10.9427 3.4182 6.4410 4.4028 6.8365 1.2682 5.0001 1.0846 1.2539 1.2498 1.2382 2.0393 1.3421 1.1870 6.1199 2.9558 3.0350 1.1888 2.8288 1.8233 1.8341 1.1160 1.1597 1.3649 1.2674 4.4509 1.0950 1.4168 1.3851 1.2277 2.1333 1.0869 1.0595 1.0388 1.0892 1.8991 5.0752 5.1581 1.0357 1.0587 1.0561 1.1036 1.1050 1.1013 1.1086 1.0866 1.0884 1.0928 1.0966 1.0918
irintensity: 0.5772 0.0099 0.0777 1.5063 0.3001 0.1020 0.2481 1.5444 1.2362 0.0045 2.1628 10.5693 0.2249 7.2840 20.6052 100.3664 4.1772 2.4390 0.0736 0.4052 0.4057 4.6620 0.0046 0.0013 0.3388 0.8280 25.3303 1.6459 45.7135 7.2580 8.2304 0.8894 2.7728 0.0996 17.9306 5.9915 0.7022 0.3137 2.2871 3.5534 8.1276 21.0729 0.3043 10.3276 11.1652 48.2424 7.4299 63.6936 30.0895 10.4004 38.0697 1.1397 20.0843 45.2873 53.2825 3.5883 1.8443 19.1564 21.1587 6.1464
temp: 298.150 k
press: 1.00000 atm
elementType: 6 6 6 6 1 6 1 6 1 1 1 16 6 1 1 6 1 1 6 1 1 1
symmnumber: 1
zpe: 488361.4 jmol-1
zpe.correction: 0.186007 hartree
zpe.thermalcorrener: 0.196380 hartree
zpe.thermalcorrenthalpy: 0.197324 hartree
zpe.thermalcorrgfe: 0.148653 hartree
zpe.sumelectzpe: -748.355629 hartree
zpe.sumelectthermal: -748.345256 hartree
zpe.sumelectthermalent: -748.344312 hartree
zpe.sumelectthermalfe: -748.392983 hartree
dipole: -0.1218 1.6718 -0.5793
dipole: 1.7735
quadrupole: -73.0704 -38.7809 -69.1473
quadrupole: 14.1799 -10.4059 0.4090
quadrupole: -12.7376 21.5520 -8.8144 14.1799 -10.4059 0.4090
hfenergy: -748.5416361 hartree
pointgroup: C01 [X(C9H12S1)]
dipole: -0.0479337 0.6577237 -0.2279054 debye
dipolederiv: 0.2415039 -0.0107294 -0.578647 -0.0687595 -0.1512416 0.1645036 -0.5518844 0.0608497 0.9360114 -0.1820058 -0.0680617 0.1497215 -0.1002728 0.0545944 0.0957717 0.16613 0.0313996 -0.4463236 -0.217951 -0.0084714 0.1679151 0.0974163 -0.0530917 -0.2223408 0.1156682 -0.0261676 -0.3337797 -0.0573772 -0.0515355 -0.1407215 -0.0782857 0.1016502 0.0180988 -0.1252555 -0.0297214 0.1050878 0.1045709 0.0767741 0.0372313 0.0652511 -0.0195304 -0.0355961 0.042344 -0.0561873 0.0951819 -0.0712541 -0.0449715 -0.1139207 -0.055902 0.1071616 -0.0293398 -0.1096317 -0.0480676 0.0873583 0.1365548 -0.0100515 0.0213809 -0.0082503 -0.0057697 0.0930046 0.0218755 0.0922314 0.056816 -0.1539439 -0.0199936 -0.0172511 0.0115489 -0.1645179 -0.025079 -0.031518 0.035662 -0.1263593 0.126183 -0.0054094 0.0469915 -0.006406 -0.0313536 0.1078009 0.0474268 0.1039551 0.0064824 0.0980885 0.0753599 0.0560182 0.0858942 -0.0671728 -0.0469849 0.0512494 -0.0287327 0.0677184 0.0903896 0.0246111 0.1165819 0.025988 0.0882357 -0.0115193 0.1145453 -0.0094132 -0.0515603 -0.2508671 -0.0600699 0.2642841 0.0039124 -0.0030158 -0.0666394 0.2383228 0.0523658 -0.6011574 0.0866299 0.0743981 0.0658324 0.1227934 0.2740472 -0.2950914 0.0359432 -0.2025705 0.1745987 -0.0896281 0.0656112 0.0039347 0.0351405 -0.0559006 0.1050844 -0.008427 0.0467266 0.0145902 0.0439708 -0.0429989 -0.0486391 -0.0686864 -0.1192826 0.0158016 -0.0094059 -0.0321736 -0.0549187 0.1880128 0.0428589 -0.0585058 -0.0742931 0.0548832 0.1929514 -0.0006821 -0.0233835 0.1813444 -0.1182753 0.0694475 -0.0050521 0.0811429 0.011556 0.0129513 -0.0544224 0.0488346 0.0235599 0.0154631 -0.0892076 -0.0492129 -0.0568536 -0.0758872 -0.0924592 -0.0217252 -0.0482995 -0.0223958 0.1055827 -0.0299477 0.0822269 0.0210083 0.090373 -0.0151503 0.0581341 0.0834677 -0.0051418 -0.1392244 0.0925854 -0.0641976 0.0374785 0.0099007 0.0438476 -0.0206685 0.0200617 0.0651749 0.024106 -0.0744222 -0.0619265 -0.0701938 -0.0733199 -0.0380605 -0.0805235 -0.1099498 -0.0144621 0.0194708 -0.0057759 0.1259558 0.0003287 0.0276819 0.0284447 0.1225049 0.0391124 -0.1578257 unknown
polarizability: 112.9670397|-6.6086182|143.6280177|-44.5801131|-16.7364817|179.2459258 unknown
InChI: InChI=1/9C.S.12H
charge 0 multiplicity 1
22 atoms
C  8.884716 7.432865 6.08481
C  8.72491 6.349969 6.959492
C  8.34846 8.673881 6.436152
C  8.044119 6.509899 8.15783
H  9.135536 5.380763 6.700543
C  7.667516 8.823187 7.642375
H  8.45146 9.52964 5.784579
C  7.510597 7.748553 8.508689
H  7.930915 5.661064 8.821731
H  7.258226 9.793012 7.900096
H  6.980545 7.871493 9.44491
S  9.779875 7.109014 4.568906
C  9.809709 8.7409 3.71677
H  8.782672 9.065184 3.539236
H  10.299669 9.468357 4.366646
C  10.562851 8.617988 2.39411
H  11.58052 8.264765 2.582706
H  10.07798 7.866823 1.764252
C  10.611163 9.955359 1.655099
H  9.605721 10.319797 1.427893
H  11.117439 10.719746 2.250681
H  11.150786 9.858863 0.710337
