program: Gaussian 09
title: TEXT
version: ES64L-G09RevD.01
method: RB3LYP
basis: TZVP
operation: Freq
keyword: #P
keyword: Geom=AllCheck
keyword: Guess=TCheck
keyword: SCRF=Check
keyword: GenChk
keyword: RB3LYP/TZVP
keyword: Freq
converged: YES YES NO YES
title: Mulliken charges:
elementType: P C H C H C H H C H H C H H C H H C H H C H H C H H C H H C H H C H H C H H P C H C H C H H C H H C H H C H H C H H C H H C H H C H H C H H C H H C H H Ni S C K H H C O H H C C C H H H H H C C H H H H O H H
charge: 0.295581 -0.210104 0.157625 -0.220687 0.168175 -0.264603 0.103678 0.159194 -0.225810 0.078183 0.123986 -0.267546 0.136200 0.113298 -0.384291 0.143798 0.134926 -0.261753 0.150837 0.111852 -0.227688 0.105973 0.120304 -0.217231 0.120543 0.105412 -0.241741 0.121169 0.113131 -0.229942 0.105260 0.126533 -0.216255 0.121823 0.096679 -0.242303 0.124591 0.101900 0.190716 -0.130840 0.157003 -0.221315 0.075843 -0.232018 0.126153 0.149872 -0.274075 0.133660 0.121551 -0.277278 0.141798 0.122219 -0.398141 0.138114 0.143665 -0.276948 0.142963 0.075174 -0.228432 0.096400 0.128908 -0.219369 0.126437 0.100252 -0.229835 0.125415 0.098834 -0.234093 0.107045 0.117692 -0.220311 0.124689 0.106941 -0.229673 0.123641 0.110065 -0.113493 -0.569174 -0.245663 0.827633 0.100992 0.098557 -0.132029 -0.398639 0.069977 0.107397 -0.395055 -0.139112 -0.067496 0.110200 0.111137 0.118042 0.161310 0.141095 -0.131606 -0.106528 0.120119 0.128002 0.155455 0.133869 -0.273024 0.105157 0.139464
chargesum: 0.00000
title: Mulliken charges with hydrogens summed into heavy atoms:
elementType: P C C C C C C C C C C C C C P C C C C C C C C C C C C C Ni S C K C O C C C C C O
charge: 0.295581 -0.052479 -0.052512 -0.001732 -0.023641 -0.018048 -0.105568 0.000936 -0.001410 0.008724 -0.007441 0.001851 0.002246 -0.015812 0.190716 0.026162 -0.145472 0.044007 -0.018865 -0.013261 -0.116362 -0.058812 -0.003124 0.007320 -0.005586 -0.009356 0.011319 0.004033 -0.113493 -0.569174 -0.046114 0.827633 0.045345 -0.398639 -0.055675 0.163293 0.180625 0.157718 0.138093 -0.273024
polarizability: 6.08398612e+02 -3.31661830e+01 5.71485961e+02 -3.36481341e+01 -2.40255358e+00 6.15131633e+02
1716.lowfreq: -0.0116 0.0038 0.0066 4.1636 6.0114 9.5963 20.7361 26.1560 27.3880
redmass: 4.4639 3.9762 3.9339 4.6261 4.4824 4.3815 3.2648 3.9424 3.9439 3.8880 3.9918 3.7787 4.3324 3.6436 3.9468 4.0315 8.0327 3.6597 4.6335 4.3906 3.2702 4.0988 1.8903 4.0963 3.5235 10.0014 6.0537 3.6342 3.5602 3.9341 4.3304 3.7562 3.8412 4.4999 2.8142 3.0743 2.8965 1.9746 2.0144 1.3490 1.9313 2.3030 2.3027 2.3141 3.6273 1.9359 3.2595 2.8323 5.1267 2.0382 2.0618 2.0827 2.3554 3.8440 5.1883 4.1849 4.0935 2.7661 2.8225 2.4266 3.0406 2.8427 2.8680 2.7880 2.7792 3.3512 2.8713 2.8755 3.1735 2.7079 1.7680 1.8877 1.8391 1.8304 4.8913 2.5862 1.6625 4.1874 2.5093 2.7075 2.5922 2.7910 1.0977 1.8951 1.4781 1.4738 1.4835 1.4686 3.1815 3.1992 3.2770 3.2574 4.0271 1.5210 1.8020 1.7783 1.8049 1.8741 1.2631 2.2162 2.3417 2.0750 2.0949 2.0742 2.1459 2.0820 2.1306 2.1755 2.0859 2.5556 2.0243 1.4163 1.3944 1.4963 1.4449 2.8939 1.9784 1.9849 1.9802 2.3799 2.1453 2.8376 1.9498 1.9490 1.9247 1.9402 1.1758 1.8744 1.8297 2.2154 1.6695 1.6700 2.7234 2.7937 2.7637 1.2265 2.8208 4.1224 1.1020 1.0963 1.1878 1.7601 1.2494 1.9803 1.6392 3.0966 1.7540 1.8452 1.8751 1.4037 2.0779 1.2742 1.2718 1.3465 1.4181 1.4814 1.5666 1.4704 1.3999 1.3973 1.2335 1.0817 1.3521 1.2879 1.2620 1.2797 1.2448 1.1748 1.2381 1.2292 1.2603 1.2461 1.2294 1.2270 1.2356 1.2122 1.1997 1.1044 1.2170 1.2150 1.2166 1.2096 1.2089 1.1614 1.3389 1.3992 1.3584 1.3327 1.3234 1.3548 1.3453 1.3132 1.3063 1.3964 1.4114 1.4249 1.3959 1.4568 1.2099 1.4515 1.4697 1.4543 1.4204 1.4050 1.4008 1.3981 1.2316 1.2778 1.2770 1.3671 1.0777 1.0999 1.0879 1.0842 1.0863 1.0862 1.0880 1.0828 1.0857 1.0862 1.0873 1.0882 1.0868 1.0904 1.0878 1.0875 1.0612 1.0614 1.0710 1.0882 1.0877 1.0881 1.0771 1.1032 1.0953 1.0926 1.0885 1.0915 1.0917 1.0914 1.0793 1.0710 1.0678 1.0676 1.0702 1.0702 1.0721 1.0683 1.0690 1.0646 1.0712 1.0652 1.0680 1.0715 1.0692 1.0648 1.0644 1.0642 1.0623 1.0551 1.0659 1.0597 1.0671 1.0378 1.0670 1.0655 1.0685 1.0730 1.0677 1.0690 1.0835 1.0978 1.0645 1.0954 1.0871 1.0907 1.0972 1.0914 1.0922 1.0795 1.0889 1.0917 1.0939 1.1001 1.0873 1.0828 1.1020 1.1014 1.0985 1.1003 1.1009 1.1096 1.0972 1.0987 1.0993 1.1008 1.0988 1.0999 1.1024 1.0943 1.0940 1.1003 1.0959
irintensity: 0.2003 0.0083 0.8648 0.2424 0.5064 0.3290 0.2904 0.3830 0.3054 0.0689 0.0993 0.3528 5.5940 0.3072 1.0286 3.5097 14.1472 2.0629 4.8707 3.3438 0.3813 1.3774 2.5070 1.3543 1.0587 16.6171 7.1304 2.8340 0.1039 0.4783 0.1745 1.5234 2.6866 1.8294 0.0483 0.8261 0.0712 1.7896 0.1346 0.2076 0.2570 1.6519 0.7783 0.6116 4.9419 6.5420 3.3207 22.4024 2.0309 1.0557 0.2943 1.0601 0.2656 14.9501 0.9752 6.7416 42.8816 5.2317 0.1057 4.7370 0.4536 0.1496 0.8071 0.7507 0.0791 1.9126 31.1217 16.0380 4.9771 0.4935 13.9060 1.9498 24.3360 28.2856 48.2007 17.7466 23.5080 4.7088 12.8716 1.3188 64.3103 23.6619 6.0914 70.6912 0.2966 0.1995 0.4243 0.0650 1.3346 5.9897 4.2492 1.3075 1.5394 8.1408 17.4895 19.9389 10.1751 7.5486 1.3788 31.9079 51.1862 6.2065 3.1285 8.9512 1.9989 4.5132 1.2367 2.5440 0.2945 42.9545 11.0583 4.5543 3.4921 1.8077 4.0210 0.0079 1.7727 6.6442 15.4228 6.0120 11.8173 0.9466 2.7658 2.5781 1.0067 0.3343 4.7873 2.4748 1.4275 10.9589 6.4869 1.3029 0.7139 0.0361 0.5593 3.8362 14.0956 132.8048 3.4927 2.6962 0.4065 1.4354 10.9730 26.9060 8.8353 105.0402 19.5169 7.4720 9.6702 4.4163 3.3951 4.2418 2.1568 15.8086 6.0333 0.8403 6.2143 1.1228 1.5496 0.4604 26.5786 3.3716 1.3441 0.7592 0.5038 1.7295 0.7583 20.9910 12.4927 0.8524 1.6441 5.6391 2.1843 2.0263 1.4545 1.5677 3.8832 0.5035 2.0587 9.2263 1.0586 3.7399 1.8573 2.8713 5.3457 2.7937 0.3096 0.3261 0.6126 1.0627 0.3202 0.3750 0.5151 1.1093 5.4066 1.4109 2.6986 0.1764 0.7596 0.0788 0.2020 0.0694 0.7221 0.4348 1.1023 0.2199 3.6757 16.6575 3.5089 0.2717 3.1194 4.8889 1.8209 3.2142 0.5722 3.4959 0.8134 1.0573 4.8889 3.2902 3.7225 6.5688 3.0245 3.1310 3.4576 11.8821 25.1562 4.2852 12.9399 7.3520 2.4565 6.7949 5.1004 17.5006 5.0128 1.0449 3.7251 3.8932 1.3838 2.9003 22.8887 44.2441 40.4771 30.7257 43.7814 32.4785 7.1258 34.8921 24.6157 30.4151 18.7432 36.3667 19.1738 62.7723 59.0030 25.1113 22.4938 25.9797 27.0009 44.8373 19.9971 78.0351 3.8167 99.8412 24.1396 1.0172 9.7684 23.3542 30.0932 18.6884 45.6885 100.6666 18.8574 106.5678 88.5150 71.0084 96.8319 109.0067 27.5156 77.0047 94.6207 67.6942 44.1541 101.5613 53.9697 91.7159 108.9587 1.4128 24.6173 77.7385 52.4816 26.8919 68.1727 9.4470 91.2980 42.7017 45.6111 48.3699 57.7481 31.9005 40.3592 39.4633 18.7441
temp: 298.150 k
press: 1.00000 atm
elementType: 15 6 1 6 1 6 1 1 6 1 1 6 1 1 6 1 1 6 1 1 6 1 1 6 1 1 6 1 1 6 1 1 6 1 1 6 1 1 15 6 1 6 1 6 1 1 6 1 1 6 1 1 6 1 1 6 1 1 6 1 1 6 1 1 6 1 1 6 1 1 6 1 1 6 1 1 28 16 6 19 1 1 6 8 1 1 6 6 6 1 1 1 1 1 6 6 1 1 1 1 8 1 1
symmnumber: 1
zpe: 2424064.2 jmol-1
zpe.correction: 0.923277 hartree
zpe.thermalcorrener: 0.970570 hartree
zpe.thermalcorrenthalpy: 0.971514 hartree
zpe.thermalcorrgfe: 0.839338 hartree
zpe.sumelectzpe: -4635.048006 hartree
zpe.sumelectthermal: -4635.000713 hartree
zpe.sumelectthermalent: -4634.999769 hartree
zpe.sumelectthermalfe: -4635.131946 hartree
dipole: 3.5673 -0.4487 -9.0517
dipole: 9.7396
quadrupole: -226.6181 -300.1433 -350.5122
quadrupole: 20.9484 -83.2246 -56.6210
quadrupole: 65.8064 -7.7188 -58.0877 20.9484 -83.2246 -56.6210
hfenergy: -4635.9712835 hartree
pointgroup: C01 [X(C33H63K1Ni1O2P2S1)]
dipole: 1.4034807 -0.1765445 -3.5612179 debye
polarizability: 608.3986118|-33.166183|571.4859606|-33.6481341|-2.4025536|615.1316327 unknown
InChI: InChI=1/33C.K.Ni.2O.2P.S.63H
charge 0 multiplicity 1
103 atoms
P  7.26247449 2.8887619 5.31037385
C  5.42827122 3.210722 4.95948293
H  4.84930469 2.32505714 5.24578108
C  7.25259549 2.59243729 7.18097076
H  7.03100825 3.5856909 7.58532022
C  8.66664203 2.22612754 7.65744661
H  8.94573991 1.24955201 7.24638896
H  9.38241866 2.95010514 7.26052304
C  5.23400162 3.46513158 3.45702882
H  5.90571306 4.27606414 3.16498159
H  5.53717706 2.59288276 2.87363882
C  6.2169547 1.6120527 7.74560869
H  5.20614637 1.89737045 7.44441931
H  6.39473887 0.61081624 7.33886908
C  7.42710555 1.13043651 4.60735339
H  6.99533307 0.39249801 5.28705601
H  6.82151066 1.1088793 3.69996062
C  4.92943189 4.42107131 5.76305471
H  5.00747752 4.23261353 6.83568293
H  5.58596193 5.27122369 5.55013656
C  6.29490177 1.5431202 9.27804902
H  6.00684035 2.51631151 9.69311047
H  5.57143101 0.81449003 9.65752286
C  3.79249343 3.8450686 3.10238263
H  3.71732255 4.05507443 2.03050591
H  3.13221902 2.9926202 3.30140599
C  8.74625849 2.15886298 9.18571967
H  9.7530707 1.86224209 9.49574034
H  8.5741325 3.16055358 9.59650334
C  3.48501203 4.79828049 5.41501497
H  2.81476094 3.98597987 5.72089659
H  3.1851205 5.68229725 5.98612479
C  7.70632336 1.19012771 9.7576031
H  7.74555276 1.18840417 10.8511456
H  7.94974761 0.17055853 9.43376269
C  3.31600607 5.05102886 3.91526464
H  2.27318108 5.28375989 3.68030917
H  3.90536631 5.93144894 3.63144251
P  9.85592183 2.30099118 3.66541466
C  11.61987291 1.69394963 4.01162253
H  11.6981083 0.64369705 3.70736139
C  9.74819502 2.10261151 1.77451379
H  10.44506134 2.86392313 1.39659326
C  8.34555109 2.49688107 1.2913414
H  7.6279255 1.74471669 1.63490848
H  8.04587089 3.43619784 1.75823664
C  11.9025594 1.79814028 5.51952173
H  11.72451933 2.83340755 5.83129147
H  11.19903585 1.18491575 6.08602934
C  10.17514198 0.77172782 1.14394444
H  11.18330598 0.49432432 1.46053392
H  9.50816332 -0.02552617 1.48631389
C  8.88219111 0.78177644 4.27324269
H  8.93618994 -0.0369477 3.55227969
H  9.39806316 0.44056716 5.17170774
C  12.65967543 2.51328785 3.23406187
H  12.50355858 2.41929683 2.15561422
H  12.52172532 3.57099185 3.4976296
C  10.11562554 0.84675569 -0.38958156
H  10.86430636 1.56844329 -0.74003908
H  10.38958435 -0.11954444 -0.82365678
C  13.33720547 1.38890053 5.87088301
H  13.5037817 1.51032531 6.94539828
H  13.47619202 0.32364481 5.64969409
C  8.27951368 2.58751839 -0.23514459
H  7.26401567 2.84118433 -0.55461334
H  8.92512775 3.40795157 -0.57344055
C  14.09877429 2.10769304 3.57667958
H  14.26849046 1.07696213 3.24405397
H  14.80561161 2.73521758 3.02402944
C  8.73079457 1.2757899 -0.88692441
H  8.73253235 1.36977961 -1.97695571
H  8.00563556 0.49064832 -0.64225556
C  14.36331105 2.20476912 5.08099214
H  15.37913399 1.8699281 5.31074289
H  14.29924372 3.25474516 5.3896627
Ni 8.95591574 4.00450321 4.56755822
S  9.57860635 6.1156404 4.8700573
C  8.15740274 7.11405079 5.54205669
K  10.73519917 5.66054876 2.04918883
H  8.43422292 8.17209333 5.5027384
H  7.29468909 6.97569424 4.88453801
C  7.78066348 6.72414861 6.96524348
O  8.41828882 6.2274671 0.78925173
H  7.58727633 5.64926301 6.97912175
H  8.64116265 6.88998535 7.62034293
C  6.56504956 7.48644295 7.49465945
C  7.31236451 6.09951368 1.70986933
C  7.98494272 6.81744245 -0.44101904
H  6.74862035 8.56496533 7.51778018
H  5.68543215 7.3174606 6.86683319
H  6.30868426 7.1736009 8.51108276
H  7.71509393 5.68194242 2.63658224
H  6.5791866 5.40658201 1.28334694
C  6.67790678 7.45135123 1.95668279
C  7.33572782 8.16688885 -0.1830855
H  7.27585209 6.14412779 -0.93874748
H  8.86632397 6.92827502 -1.0759587
H  5.79307533 7.34496592 2.58445125
H  7.39283007 8.11094389 2.46567108
O  6.24670277 8.04748305 0.72709009
H  8.0851994 8.86670884 0.21461538
H  6.93479247 8.57829427 -1.1111249
