program: Gaussian 16
title: TEXT
version: ES64L-G16RevB.01
method: RB3LYP
basis: TZVP
operation: Freq
keyword: #P
keyword: Geom=AllCheck
keyword: Guess=TCheck
keyword: SCRF=Check
keyword: GenChk
keyword: RB3LYP/TZVP
keyword: Freq
converged: YES YES NO YES
title: Mulliken charges:
elementType: C H H C H H C H H H H Se
charge: -0.234150 0.138942 0.138958 -0.213537 0.122398 0.122337 -0.367777 0.116025 0.115980 0.133501 0.050800 -0.123476
chargesum: -0.00000
title: Mulliken charges with hydrogens summed into heavy atoms:
elementType: C C C Se
charge: 0.043750 0.031197 -0.002271 -0.072676
polarizability: 6.01671205e+01 7.77727447e+00 7.91746449e+01 -9.75355619e+00 -1.15025382e+01 7.40201927e+01
1716.lowfreq: 0.0147 0.0169 0.0186 4.5686 14.8351 24.3174 100.3806 149.5152 203.6046
frequency: 100.3488 149.4183 203.5846 249.3491 305.3379 640.4466 757.7492 761.7449 865.0613 921.1832 1039.9340 1045.5713 1121.9278 1245.9754 1247.8488 1333.5629 1376.1490 1420.7032 1487.4554 1494.5627 1498.7629 1508.4538 2400.8019 3024.4556 3027.6588 3055.5419 3069.6926 3088.5665 3091.7829 3127.5878
redmass: 2.0902 1.1319 3.4358 1.0933 3.6538 3.0360 1.2244 1.0853 1.1924 1.7511 2.9473 1.1227 1.9592 1.4149 1.2506 1.1003 1.3849 1.2244 1.0925 1.0534 1.0385 1.0860 1.0203 1.0354 1.0590 1.1036 1.0565 1.1036 1.1012 1.1106
irintensity: 3.0911 7.9578 1.5568 0.0007 0.0106 3.8961 3.4859 6.4743 0.2269 4.2498 0.0640 4.9399 7.6376 3.7605 57.7189 0.1225 2.8811 2.8879 4.0774 1.0770 10.4934 7.9948 34.0296 32.7304 19.2264 3.9366 28.1295 49.8924 45.2799 21.3792
temp: 298.150 k
press: 1.00000 atm
elementType: 6 1 1 6 1 1 6 1 1 1 1 34
symmnumber: 1
zpe: 267133.4 jmol-1
zpe.correction: 0.101746 hartree
zpe.thermalcorrener: 0.108003 hartree
zpe.thermalcorrenthalpy: 0.108947 hartree
zpe.thermalcorrgfe: 0.071215 hartree
zpe.sumelectzpe: -2520.674492 hartree
zpe.sumelectthermal: -2520.668236 hartree
zpe.sumelectthermalent: -2520.667291 hartree
zpe.sumelectthermalfe: -2520.705023 hartree
dipole: 0.3070 1.8302 -0.2380
dipole: 1.8709
quadrupole: -34.9103 -12.0031 -39.3344
quadrupole: 20.1810 -2.9691 5.2499
quadrupole: -6.1611 16.7462 -10.5851 20.1810 -2.9691 5.2499
hfenergy: -2520.7762382 hartree
pointgroup: C01 [X(C3H8Se1)]
dipole: 0.120767 0.7200483 -0.0936414 debye
dipolederiv: 0.1205809 0.1532792 -0.0483825 0.1301576 0.3590417 -0.2238346 -0.0537816 -0.2756528 0.1378782 -0.0348046 0.0366525 0.046099 0.0641519 -0.1521549 0.0653177 0.0062635 0.0827932 0.0184034 -0.0143431 -0.1068884 -0.0513844 -0.1156699 -0.1183944 -0.0043977 -0.0071611 0.020276 -0.0364405 0.1501702 0.0074759 0.0126331 -0.0885701 -0.0377573 0.1531221 -0.0096992 -0.0632968 0.163441 -0.0754885 0.0971732 0.0211788 0.1070265 -0.0469121 0.0017974 -0.0099098 0.0416241 0.0308643 -0.0396759 -0.0896471 -0.0877656 -0.0694721 -0.0094721 -0.0649173 -0.0497908 -0.0367403 -0.0440259 0.114809 -0.0570913 0.0617257 0.0009199 0.1093145 -0.0108477 0.0760686 0.1161297 0.0082652 -0.0958941 0.1344053 -0.0200988 0.0736089 -0.0476535 0.0342632 0.0044662 0.0030942 0.075247 -0.0354772 -0.0856982 -0.0853941 -0.0674066 -0.010928 -0.0196859 -0.1201795 -0.0806885 -0.0224418 0.033109 -0.0261035 0.1119787 -0.0132068 0.0095751 0.0116083 0.1144756 0.0399546 -0.1580103 0.0635465 -0.01423 0.0931611 0.0193029 -0.0815167 -0.0907204 0.1008907 -0.0158248 -0.1229824 -0.1865322 -0.0493278 -0.053751 -0.0408422 0.0268577 0.148295 -0.0516424 0.1683314 -0.0501981 unknown
polarizability: 60.1671205|7.7772745|79.1746449|-9.7535562|-11.5025382|74.0201927 unknown
InChI: InChI=1/3C.Se.8H
charge 0 multiplicity 1
12 atoms
C  9.83570859 8.72672392 3.69147477
H  8.93312835 9.33638264 3.66912864
H  10.54327133 9.16423218 4.39486273
C  10.4488849 8.60431784 2.30222071
H  11.32904786 7.95592861 2.34465297
H  9.73513386 8.12442466 1.62606837
C  10.8455631 9.97137834 1.74252303
H  9.97875932 10.63270337 1.66071348
H  11.58190062 10.46343281 2.38368431
H  11.28427279 9.87330774 0.74670655
H  8.81126273 7.41797276 5.67392424
Se 9.32936257 6.92475914 4.3877612
