program: Gaussian 16
title: TEXT
version: ES64L-G16RevB.01
method: RB3LYP
basis: TZVP
operation: Freq
keyword: #P
keyword: Geom=AllCheck
keyword: Guess=TCheck
keyword: SCRF=Check
keyword: GenChk
keyword: RB3LYP/TZVP
keyword: Freq
converged: YES YES YES YES
title: Mulliken charges:
elementType: P C H C H C H H C H H C H H C H H C H H C H H C H H C H H C H H C H H C H H P C H C H C H H C H H C H H C H H C H H C H H C H H C H H C H H C H H C H H Ni C H H C H H C H H H C C C C H C H C H H H Se
charge: 0.332393 -0.208214 0.158126 -0.233780 0.195915 -0.302749 0.119434 0.156308 -0.255565 0.118069 0.124009 -0.266562 0.140340 0.116664 -0.397037 0.146097 0.148571 -0.240804 0.138445 0.128871 -0.225433 0.107761 0.125450 -0.219816 0.125052 0.101252 -0.234530 0.126793 0.105839 -0.238904 0.103148 0.126512 -0.220458 0.125973 0.101412 -0.231466 0.122983 0.106347 0.308209 -0.185366 0.157886 -0.207706 0.161554 -0.266762 0.110291 0.151666 -0.272434 0.122743 0.129986 -0.260349 0.138717 0.115727 -0.394811 0.149604 0.144776 -0.276583 0.139685 0.121492 -0.230130 0.106919 0.124737 -0.224477 0.123923 0.103757 -0.234313 0.125783 0.110533 -0.215582 0.102150 0.125347 -0.221588 0.125743 0.100092 -0.230688 0.124756 0.106129 -0.184035 -0.275449 0.143285 0.131186 -0.195284 0.133084 0.117429 -0.368309 0.112349 0.127340 0.112828 -0.091224 -0.130047 -0.096973 -0.090873 0.128958 -0.130178 0.153059 -0.136179 0.121398 0.124418 0.125761 -0.070408
chargesum: -0.00000
title: Mulliken charges with hydrogens summed into heavy atoms:
elementType: P C C C C C C C C C C C C C P C C C C C C C C C C C C C Ni C C C C C C C C C Se
charge: 0.332393 -0.050089 -0.037865 -0.027008 -0.013486 -0.009558 -0.102368 0.026511 0.007778 0.006488 -0.001897 -0.009243 0.006927 -0.002136 0.308209 -0.027480 -0.046152 -0.004806 -0.019704 -0.005905 -0.100431 -0.015406 0.001526 0.003203 0.002003 0.011916 0.004246 0.000197 -0.184035 -0.000978 0.055229 -0.015792 -0.091224 -0.001089 0.056086 0.030526 -0.005760 -0.010418 -0.070408
chargesum: 0.00000
polarizability: 6.33697806e+02 -3.29850723e+01 6.27692301e+02 -2.90515916e+01 4.29585041e+01 5.91328894e+02
1716.lowfreq: -4.4974 -0.0053 -0.0046 -0.0036 4.1247 7.1670 10.2565 13.6469 20.7676
redmass: 4.9596 4.3569 4.1447 4.2829 4.3750 4.3528 3.0767 4.9227 3.9102 3.2748 3.8286 3.6057 3.9099 3.6763 3.3146 3.0954 1.7526 3.1103 3.9976 4.4700 4.7132 3.0132 2.9963 4.7259 3.9373 3.5327 3.6172 3.7962 4.4642 3.4175 2.9395 3.1436 2.8725 2.0252 2.2492 1.7725 2.0923 1.8700 3.0799 2.3386 2.2284 3.4113 7.1194 4.3451 6.8059 2.0114 1.9621 2.0352 2.2476 3.7211 4.1736 4.0971 2.9111 2.8382 2.3228 3.0364 3.0846 2.8215 2.8688 2.7547 2.8915 2.7517 3.0596 3.4789 1.7314 1.8574 1.7388 1.9141 3.6810 3.6278 3.0234 6.4040 4.6277 6.7591 2.5161 1.2109 2.7365 1.2125 2.5274 2.5597 1.9283 1.4712 1.4679 1.4799 1.4741 3.3008 3.3296 3.3015 3.3066 1.2362 1.2436 1.5156 1.8108 1.8132 1.7708 1.9561 2.0393 2.0383 2.1902 2.1156 1.8826 1.8586 1.5965 1.9757 1.9141 1.9974 1.4056 1.3874 1.5259 1.4847 1.2525 1.3076 2.9552 6.1110 2.0108 2.0090 2.0814 2.0805 2.7483 3.9052 1.9776 1.9490 1.1906 1.9223 1.9485 1.8787 1.8681 1.6872 1.6902 2.1743 2.8569 2.7917 2.9962 2.9933 1.1017 1.6565 1.0800 1.0970 1.8044 1.1536 1.0943 1.5867 1.7603 1.9852 1.8880 1.3879 1.1251 1.2742 1.2723 1.1646 1.3435 1.3548 1.5326 1.5246 1.2800 1.3828 1.3720 1.4172 1.3449 1.2673 1.2785 1.2591 1.2675 1.2617 1.2504 1.2512 1.2296 1.2321 1.2486 1.2400 1.2234 4.2743 1.1979 1.1034 1.2258 1.2249 1.2056 1.1863 1.4654 1.3257 1.3331 1.3558 1.3535 1.3692 1.3446 1.3279 1.3195 1.2947 1.4516 1.3999 1.4295 1.4120 1.4473 1.4398 1.4629 1.4254 1.4133 1.3985 1.3955 1.3845 1.2240 1.0785 1.3353 1.5515 1.0957 1.0865 1.0859 1.0878 1.0898 1.0897 1.0910 1.0908 1.0875 1.0929 1.0870 1.0873 1.0504 1.0807 1.0874 1.0870 1.0888 1.0883 1.0389 1.0972 1.0956 1.4799 1.2874 1.1167 1.1015 5.3256 5.1813 1.0682 1.0685 1.0703 1.0698 1.0715 1.0710 1.0752 1.0721 1.0701 1.0641 1.0615 1.0611 1.0616 1.0622 1.0625 1.0668 1.0729 1.0698 1.0666 1.0673 1.0642 1.0349 1.0695 1.0695 1.0598 1.0778 1.0615 1.0978 1.0964 1.0966 1.0953 1.0909 1.0911 1.0897 1.0900 1.0696 1.1012 1.1011 1.1015 1.0959 1.0982 1.0619 1.1007 1.1009 1.0999 1.0962 1.0977 1.0977 1.0954 1.0979 1.1016 1.1016 1.1032 1.1009 1.1080 1.0858 1.0879 1.0915 1.0932 1.0978
irintensity: 0.0329 0.0203 0.0525 0.0782 0.0535 0.2325 0.0441 0.2283 0.0051 0.0612 0.0083 0.0180 0.0127 0.0076 0.1969 0.0453 0.0312 0.0217 1.3196 0.0952 0.5291 0.6752 0.1709 0.5157 0.0752 0.6329 0.1334 2.7692 2.0841 0.4392 0.0395 1.4293 0.0430 0.1666 0.7939 0.0954 1.6170 0.3166 0.2803 0.3846 0.0636 2.0489 21.5895 6.6253 37.9967 0.9920 2.1025 1.0734 4.8691 11.5016 6.3098 31.2468 0.5782 15.2781 1.6734 1.8694 0.1990 3.4154 6.2156 0.6628 26.5767 35.0806 5.0092 32.9311 11.5365 3.2460 16.9080 37.0721 43.0675 0.1352 38.0143 0.1456 15.3773 1.1658 12.2097 58.2396 1.8644 14.4551 41.5077 40.9459 55.6204 0.6275 0.0519 0.1790 0.3952 3.0683 6.8657 1.0975 0.7245 1.9993 3.3943 9.2527 30.0798 1.8583 18.1793 1.0137 5.1182 4.0867 0.1363 4.6050 1.2428 1.6014 0.8809 0.1235 1.7295 17.2246 4.0254 3.5997 0.8261 7.7169 0.0404 0.2033 0.0250 2.6167 3.2437 2.9113 16.8309 18.9840 2.3504 10.3139 3.9986 3.9593 8.6400 0.3348 0.1234 1.6334 1.8248 7.0468 1.9590 0.2894 0.1900 0.2666 0.5027 1.3497 1.6677 6.3709 0.5156 3.7162 26.4518 2.7980 5.0230 10.7373 7.5352 4.5264 11.4717 10.6078 0.2560 4.0495 1.9979 2.2331 17.3957 4.8865 4.4364 9.5248 13.6243 1.4942 4.0518 4.3440 0.8324 0.2081 0.1104 0.4127 0.7459 3.7187 3.4920 1.1300 4.0839 0.2308 2.5249 1.1114 1.7785 0.6805 2.1123 0.4887 3.0109 0.2433 2.7307 1.5376 2.8949 0.7642 0.0630 0.5375 0.8330 0.7874 0.1825 0.2711 1.8481 1.1808 6.2918 0.7779 2.9311 1.4050 0.2340 0.2701 0.2553 1.4780 0.4252 0.4636 0.5733 0.3888 2.7020 3.7143 2.6110 11.9373 5.2116 3.2447 2.2002 5.8160 0.5148 2.6279 8.8782 7.4611 1.2251 2.0332 4.0954 15.2173 1.8902 29.8516 1.3841 5.6669 6.7154 12.7492 8.9322 2.1950 7.0977 15.1722 2.4516 1.2343 1.2190 15.1459 13.1891 26.1896 33.8438 18.7378 46.4733 12.7558 23.2515 6.3577 45.8739 5.1791 34.5773 29.4701 51.8460 10.2189 22.8460 16.2456 28.1601 22.4361 22.0476 33.4492 21.5939 17.3241 50.2016 33.4893 13.7673 17.3589 12.3861 24.4656 66.7525 91.3629 28.0814 147.6156 142.8783 70.7491 99.2666 97.1560 56.2515 69.6843 106.9946 28.3109 17.1105 1.6967 11.9507 60.0204 12.6147 16.1945 22.7184 114.6796 177.4388 58.8346 42.6385 0.6175 58.6474 42.3775 35.7984 23.3892 1.6449 4.4030 10.5935 18.5859 25.3219
temp: 298.150 k
press: 1.00000 atm
elementType: 15 6 1 6 1 6 1 1 6 1 1 6 1 1 6 1 1 6 1 1 6 1 1 6 1 1 6 1 1 6 1 1 6 1 1 6 1 1 15 6 1 6 1 6 1 1 6 1 1 6 1 1 6 1 1 6 1 1 6 1 1 6 1 1 6 1 1 6 1 1 6 1 1 6 1 1 28 6 1 1 6 1 1 6 1 1 1 6 6 6 6 1 6 1 6 1 1 1 34
symmnumber: 1
zpe: 2334494.0 jmol-1
zpe.correction: 0.889162 hartree
zpe.thermalcorrener: 0.933119 hartree
zpe.thermalcorrenthalpy: 0.934063 hartree
zpe.thermalcorrgfe: 0.807579 hartree
zpe.sumelectzpe: -5962.386285 hartree
zpe.sumelectthermal: -5962.342328 hartree
zpe.sumelectthermalent: -5962.341384 hartree
zpe.sumelectthermalfe: -5962.467868 hartree
dipole: 0.0541 -1.3281 1.3604
dipole: 1.9020
quadrupole: -277.0015 -286.9999 -265.1658
quadrupole: -12.9673 8.5689 0.6099
quadrupole: -0.6124 -10.6109 11.2233 -12.9673 8.5689 0.6099
hfenergy: -5963.275447 hartree
pointgroup: C01 [X(C35H60Ni1P2Se1)]
dipole: 0.0212714 -0.5225287 0.5352242 debye
polarizability: 633.6978062|-32.9850723|627.6923013|-29.0515916|42.9585041|591.3288944 unknown
InChI: InChI=1/35C.Ni.2P.Se.60H
charge 0 multiplicity 1
99 atoms
P  6.99868746 2.32790186 5.49561943
C  5.17672306 2.4590437 5.04308059
H  4.63292374 1.61835003 5.48928197
C  6.9943938 2.51310187 7.36782448
H  6.68856854 3.55552038 7.50332321
C  8.42502822 2.39322626 7.91519492
H  8.78516139 1.36843668 7.77418275
H  9.09347245 3.03844645 7.33923402
C  5.0300963 2.39166246 3.5131079
H  5.67317794 3.16192491 3.07223557
H  5.39281706 1.43387971 3.13300044
C  6.03263936 1.62285803 8.16394654
H  5.00891289 1.73381419 7.79916855
H  6.30382709 0.57058044 8.02571057
C  7.3736966 0.49630525 5.2076225
H  7.01452352 -0.11746547 6.03696628
H  6.79612594 0.20554469 4.32881565
C  4.59476995 3.77983604 5.57483172
H  4.63259362 3.80780086 6.66551683
H  5.22128882 4.60669986 5.22351694
C  6.08593699 1.95857583 9.66159812
H  5.70952552 2.97760208 9.81011625
H  5.41908093 1.29348253 10.21867257
C  3.58382831 2.61275981 3.05792735
H  3.53341144 2.58853034 1.96512038
H  2.95802564 1.78798587 3.4198766
C  8.4810383 2.73490295 9.4073276
H  9.50196208 2.61581859 9.78257129
H  8.21607749 3.79005291 9.54333938
C  3.15125067 4.00582183 5.11235552
H  2.50321257 3.24268785 5.56035379
H  2.79712521 4.97363512 5.48010649
C  7.51207604 1.86349231 10.21301257
H  7.52994501 2.14936231 11.26883154
H  7.84606799 0.8199158 10.1649132
C  3.02908619 3.93664908 3.5887202
H  1.98652187 4.06462719 3.28265625
H  3.59352977 4.76545408 3.14525892
P  9.70028007 1.65721228 3.98818957
C  11.50409421 1.40676676 4.4776771
H  11.72651045 0.33342827 4.46333621
C  9.63924272 1.07155975 2.19889701
H  10.24417272 1.82051084 1.6761645
C  8.2058253 1.19562575 1.65794076
H  7.55587742 0.49104858 2.18773346
H  7.82016728 2.19590395 1.87127493
C  11.71169259 1.93887351 5.90657038
H  11.3763449 2.9823221 5.93487487
H  11.08260163 1.3954801 6.61499792
C  10.2188175 -0.31514351 1.89247375
H  11.25030751 -0.39207832 2.24485118
H  9.64598979 -1.079829 2.42745252
C  8.87130467 0.24825431 4.95681275
H  9.02579652 -0.7122689 4.46073511
H  9.40139395 0.19479564 5.90895981
C  12.44626686 2.12719023 3.50133195
H  12.35351336 1.70773103 2.49733457
H  12.13914917 3.17755787 3.43163711
C  10.1598788 -0.6191981 0.38839194
H  10.81702572 0.07905256 -0.1433579
H  10.54782954 -1.62396886 0.19504988
C  13.17583953 1.85889775 6.35083258
H  13.28050889 2.27776357 7.35636958
H  13.47895015 0.80696359 6.41573927
C  8.14477407 0.89283046 0.1575946
H  7.11058671 0.95333553 -0.19457645
H  8.70745437 1.66091922 -0.38585549
C  13.91111752 2.05315888 3.94879162
H  14.2469589 1.00985264 3.9111187
H  14.53962909 2.60954509 3.24680509
C  8.73493732 -0.48521149 -0.1579347
H  8.72401203 -0.66698163 -1.23663872
H  8.10328815 -1.25801142 0.29697042
C  14.09644306 2.58869947 5.37021863
H  15.14079078 2.49178227 5.68126611
H  13.86018777 3.65939233 5.38497015
Ni 8.55436392 3.41210544 4.46302987
C  10.355345 6.45601608 4.60636191
H  10.61070142 6.09054097 5.60125754
H  11.04290302 5.99813975 3.89366023
C  10.3771197 7.97381263 4.53514981
H  9.61453044 8.38037185 5.20511375
H  10.10839721 8.29397725 3.52425662
C  11.74661417 8.54187623 4.91464168
H  12.52906843 8.17040374 4.2470146
H  11.74992608 9.63344504 4.85720983
H  12.02057857 8.26192853 5.93565431
C  7.5774774 6.43910772 5.60572148
C  6.48830709 7.25912521 5.3245584
C  7.86876715 6.10428391 6.92784814
C  5.68447976 7.73180339 6.36091374
H  6.26038274 7.52178741 4.29844193
C  7.07836538 6.59390617 7.96089179
H  8.69672004 5.44135351 7.14559866
C  5.97782929 7.4025064 7.6796697
H  4.83128394 8.36052106 6.1340636
H  7.30991694 6.32999082 8.9863458
H  5.35421607 7.771534 8.48499096
Se 8.59142946 5.63161712 4.12665198
