program: Gaussian 16
title: TEXT
version: ES64L-G16RevA.03
method: RB3LYP
basis: TZVP
operation: Freq
keyword: #P
keyword: Geom=AllCheck
keyword: Guess=TCheck
keyword: SCRF=Check
keyword: GenChk
keyword: RB3LYP/TZVP
keyword: Freq
converged: YES YES YES YES
title: Mulliken charges:
elementType: C C C C H C H C H H H C N
charge: -0.034105 -0.105015 -0.104990 -0.111470 0.155951 -0.111465 0.156027 -0.107588 0.138476 0.138481 0.141018 -0.018607 -0.136713
chargesum: 0.00000
title: Mulliken charges with hydrogens summed into heavy atoms:
elementType: C C C C C C C N
charge: -0.034105 0.050936 0.051037 0.027006 0.027016 0.033430 -0.018607 -0.136713
polarizability: 6.83118875e+01 -1.79700408e+01 9.66193517e+01 1.57197285e+01 3.02131116e+01 1.19493549e+02
1716.lowfreq: -7.0713 -0.0003 0.0005 0.0006 4.5667 15.2937 143.4635 170.4364 389.7740
frequency: 143.4615 170.4363 389.7739 406.2271 468.6808 569.2768 579.2561 641.9369 681.2693 769.3950 775.4689 860.7786 944.1552 986.0129 1002.1116 1019.0966 1051.4138 1111.8068 1198.5701 1209.4184 1221.6950 1321.5207 1361.0856 1479.7869 1525.9681 1615.5372 1641.3531 2341.1638 3178.7970 3188.4337 3195.9777 3204.5523 3207.7087
redmass: 5.7971 6.6301 4.6251 2.9308 8.5734 4.5167 7.9085 6.8326 2.4572 1.5578 6.1327 1.2471 1.3500 1.3606 1.2436 6.2098 2.2539 1.6014 1.1210 1.3446 2.5990 4.5801 1.4701 2.1744 2.1495 5.1226 5.3303 12.6860 1.0871 1.0894 1.0929 1.0949 1.0981
irintensity: 2.4833 6.1879 0.7482 0.0005 0.0005 19.6302 0.4955 0.2817 31.5039 73.1638 2.9500 0.0002 4.0880 0.0024 0.0321 0.4372 7.1427 7.1633 0.4266 4.1946 1.0823 3.6803 1.2996 9.9918 10.3047 1.2813 4.2728 88.0187 0.1023 3.8404 8.5559 6.5391 3.1063
temp: 298.150 k
press: 1.00000 atm
elementType: 6 6 6 6 1 6 1 6 1 1 1 6 7
symmnumber: 1
zpe: 259961.2 jmol-1
zpe.correction: 0.099014 hartree
zpe.thermalcorrener: 0.105117 hartree
zpe.thermalcorrenthalpy: 0.106062 hartree
zpe.thermalcorrgfe: 0.068749 hartree
zpe.sumelectzpe: -324.514044 hartree
zpe.sumelectthermal: -324.507941 hartree
zpe.sumelectthermalent: -324.506997 hartree
zpe.sumelectthermalfe: -324.544309 hartree
dipole: 0.2313 3.0053 4.4999
dipole: 5.4161
quadrupole: -41.0828 -1.7034 1.9145
quadrupole: 22.7366 41.9006 46.3071
quadrupole: -27.4589 11.9205 15.5384 22.7366 41.9006 46.3071
hfenergy: -324.6130585 hartree
pointgroup: C01 [X(C7H5N1)]
dipole: 0.0909814 1.1823581 1.7704061 debye
dipolederiv: 0.1044231 -0.0358805 0.0092083 -0.0358621 0.0268822 -0.1331788 0.0097023 -0.1331603 -0.0870442 -0.0627161 -0.0066934 0.0877455 -0.0882979 -0.0026972 -0.0258419 -0.0237941 0.1360184 0.0242156 -0.0607338 -0.0846119 -0.0152898 -0.002176 -0.0114986 0.1285769 0.0968279 -0.0327577 0.035608 -0.0649361 -0.0245053 0.1188007 -0.0075081 -0.1798236 -0.0657773 0.1417551 -0.0990044 0.0030667 0.0968179 0.0801926 -0.0123119 0.0821372 0.0224075 -0.021568 -0.0080653 -0.0277868 0.1050204 -0.0838618 -0.1117944 -0.033927 -0.1278431 0.0449148 0.0034019 -0.0576605 0.0371172 -0.2056346 0.0914 0.0437298 -0.072554 0.0403875 0.1062781 0.0088931 -0.0776938 0.0157442 0.0264672 -0.0436947 -0.0668291 0.0538814 -0.0674908 0.0223997 0.0544296 0.0532294 0.0538291 0.059335 0.0731523 0.0506539 -0.0925349 0.0538539 0.0919394 0.0205209 -0.0884965 0.0140202 -0.0001183 0.0800249 0.1010925 -0.0105103 0.0967614 -0.0085297 -0.0303199 -0.0148111 -0.0247302 0.0924358 0.1272719 0.0183121 -0.0251841 0.0190988 0.0557395 -0.0923934 -0.0237218 -0.0912371 -0.0165088 0.102737 0.0551036 -0.0028657 0.0564467 0.3005802 0.323388 -0.0016694 0.3212985 0.5725635 -0.3598846 -0.0187699 -0.0044582 -0.0195076 -0.4685923 -0.170131 -0.0056022 -0.1693511 -0.6094064 unknown
polarizability: 68.3118875|-17.9700408|96.6193517|15.7197285|30.2131116|119.4935489 unknown
InChI: InChI=1/7C.N.5H
charge 0 multiplicity 1
13 atoms
C  8.45024922 7.32262328 5.68876209
C  9.26763878 6.92171003 6.7532276
C  7.69260895 8.49701094 5.78252161
C  9.32213281 7.69658565 7.90325419
H  9.84947398 6.0128751 6.67229944
C  7.75694185 9.26198489 6.93863672
H  7.06370045 8.79922427 4.95535077
C  8.5691533 8.86405326 7.9972733
H  9.95322339 7.38884896 8.72755186
H  7.17223543 10.17025423 7.01329673
H  8.61500117 9.46475531 8.89741239
C  8.38898398 6.52947479 4.50136528
N  8.3393813 5.88937489 3.54273421
