program: Gaussian 16
title: Title Card Required
version: ES64L-G16RevA.03
method: RB3LYP
basis: TZVP
operation: Freq
keyword: #P
keyword: Geom=AllCheck
keyword: Guess=TCheck
keyword: SCRF=Check
keyword: GenChk
keyword: RB3LYP/TZVP
keyword: Freq
converged: YES YES YES YES
title: Mulliken charges:
elementType: C C H H H C H H H C H H H O H
charge: 0.128717 -0.380907 0.116005 0.133478 0.118075 -0.342694 0.126002 0.126002 0.113646 -0.380904 0.133478 0.116004 0.118075 -0.390853 0.265877
chargesum: -0.00000
title: Mulliken charges with hydrogens summed into heavy atoms:
elementType: C C C C O
charge: 0.128717 -0.013349 0.022956 -0.013348 -0.124976
chargesum: 0.00000
polarizability: 5.96949180e+01 -1.02614012e+00 6.33686024e+01 -1.34285102e-05 -4.56846251e-05 6.18317625e+01
1716.lowfreq: -23.4452 -0.0005 0.0008 0.0009 6.3052 25.0258 213.4893 279.4901 289.2596
frequency: 213.4787 279.4844 289.2488 298.3857 352.1287 354.0294 433.9699 475.1594 476.1117 754.1179 913.6091 917.8596 934.9813 975.1460 1038.2839 1056.0823 1163.7245 1229.3638 1260.6236 1365.0038 1409.2693 1414.1432 1436.8685 1477.1403 1484.5479 1489.3710 1500.8203 1509.3903 1519.1321 3020.6986 3025.6884 3039.3455 3082.0133 3088.8952 3102.0040 3103.2935 3108.8994 3111.2598 3779.5285
redmass: 1.0133 1.0647 1.0463 1.0270 2.3811 2.5637 2.2287 2.5619 2.9524 3.9899 2.7788 1.6792 1.7388 1.2062 1.3610 1.4026 1.4054 2.3891 2.7100 1.6234 1.2555 1.3371 1.2303 1.0460 1.0449 1.0429 1.0599 1.0892 1.0569 1.0368 1.0365 1.0356 1.1005 1.0997 1.1032 1.1028 1.1026 1.1023 1.0662
irintensity: 5.5322 19.9370 0.0511 104.8066 1.9365 12.3577 1.0519 10.2577 11.9767 5.2629 51.8299 0.0297 5.0729 0.0009 14.3749 2.0965 63.7058 55.0798 30.7478 40.9468 20.1552 28.3971 5.2386 0.1463 0.0015 0.1274 4.8591 5.4055 11.8171 21.1300 37.8233 8.5593 4.1307 71.1803 4.3421 4.9772 53.3324 65.9733 21.4067
temp: 298.150 k
press: 1.00000 atm
elementType: 6 6 1 1 1 6 1 1 1 6 1 1 1 8 1
symmnumber: 1
zpe: 355788.0 jmol-1
zpe.correction: 0.135512 hartree
zpe.thermalcorrener: 0.142117 hartree
zpe.thermalcorrenthalpy: 0.143061 hartree
zpe.thermalcorrgfe: 0.106659 hartree
zpe.sumelectzpe: -233.646248 hartree
zpe.sumelectthermal: -233.639644 hartree
zpe.sumelectthermalent: -233.638700 hartree
zpe.sumelectthermalfe: -233.675101 hartree
dipole: 1.2445 1.4032 -0.0000
dipole: 1.8756
quadrupole: -36.2062 -31.1869 -34.0106
quadrupole: -3.3295 0.0001 -0.0000
quadrupole: -2.4050 2.6144 -0.2094 -3.3295 0.0001 -0.0000
hfenergy: -233.7817604 hartree
pointgroup: C01 [X(C4H10O1)]
dipole: 0.4896386 0.5520635 -0.0000099 debye
dipolederiv: 0.8534946 0.0064161 0.0000008 -0.0214742 0.4308608 0.0000041 0.0000027 0.0000051 0.5427972 0.0293854 -0.0046775 -0.0211667 -0.0722791 0.0358982 -0.0735951 -0.0889237 -0.0696874 -0.0898881 0.0375155 0.0932225 -0.0073461 0.067619 -0.1755695 -0.0311008 -0.0297965 0.0133907 0.0452383 0.0468811 -0.0428135 0.078939 -0.0455602 0.014047 0.0969471 0.0416033 0.055888 -0.1097642 -0.1635165 -0.0095096 -0.0331838 0.0159466 0.07523 -0.0096476 0.011406 -0.0107654 0.0595769 0.0722201 0.0000045 0.0000008 0.0751941 -0.077759 0.0000065 -0.0000041 0.000006 0.0569986 0.0520342 -0.046641 0.0777265 -0.0129847 -0.0096854 0.0700619 0.0648109 0.1134208 -0.0879629 0.052036 -0.046648 -0.0777216 -0.0129898 -0.009703 -0.0700706 -0.0648076 -0.1134292 -0.0879493 -0.1544471 0.0366014 -0.0000039 -0.0189949 0.0550297 0.000001 -0.0000015 0.0000018 0.0817201 0.0293787 -0.0046791 0.0211713 -0.0722708 0.0358991 0.0735827 0.0889321 0.0696773 -0.0899016 0.0468858 -0.0428191 -0.0789294 -0.0455606 0.0140332 -0.0969594 -0.0415936 -0.0559007 -0.1097512 0.0375152 0.0932215 0.0073378 0.0676217 -0.1755669 0.0311228 0.0297908 -0.0133686 0.0452383 -0.1635167 -0.0095077 0.0331785 0.0159433 0.0752325 0.0096471 -0.0114122 0.0107638 0.0595756 -1.0941234 -0.0066227 -0.0000033 0.0393123 -0.3713765 -0.0000101 -0.0000053 -0.000013 -0.683525 0.3182572 -0.0155479 0. 0.0204773 0.0834296 0.0000102 -0.0000014 0.0000109 0.3675973 unknown
polarizability: 59.694918|-1.0261401|63.3686024|-0.0000134|-0.0000457|61.8317625 unknown
InChI: InChI=1/4C.O.10H
charge 0 multiplicity 1
15 atoms
C  -0.51106648 0.36649579 0.00003627
C  -0.00897373 1.07630867 1.25953959
H  -0.33967833 2.11919692 1.27491333
H  -0.39622705 0.58328005 2.153251
H  1.08263586 1.07253606 1.30640092
C  -0.09616962 -1.10025167 0.00010823
H  -0.48797123 -1.60610206 0.88457812
H  -0.48795212 -1.60618254 -0.88432412
H  0.9915289 -1.19424663 0.00012402
C  -0.00894249 1.07619321 -1.25951968
H  -0.39616927 0.58307958 -2.15319566
H  -0.33965224 2.11907819 -1.27499955
H  1.08266847 1.07242143 -1.30635081
O  -1.95729029 0.34791321 0.00001879
H  -2.26753579 1.26185461 -0.00001346
