program: Gaussian 09
title: 000006866
version: EM64L-G09RevD.01
frameworkgroup: C1[X(C9H5Cl2N)]
method: RPBEPBE
basis: SDD
operation: Freq
keyword: #p
keyword: freq=noraman
keyword: PBEPBE/SDD
title: #p freq=noraman PBEPBE/SDD
converged: NO NO NO YES
title: Mulliken charges:
elementType: Cl Cl N C C C C C C C C C H H H H H
charge: -0.034152 -0.037520 -0.023746 0.442472 -0.039992 -0.336051 -0.173857 -0.269375 -0.222194 -0.101997 -0.169701 -0.354212 0.260185 0.291111 0.261541 0.257860 0.249629
chargesum: 0.00000
title: Mulliken charges with hydrogens summed into heavy atoms:
elementType: Cl Cl N C C C C C C C C C
charge: -0.034152 -0.037520 -0.023746 0.442472 -0.039992 -0.075867 -0.173857 0.021736 0.039347 -0.101997 0.088159 -0.104583
polarizability: 1.93033331e+02 1.12259959e+01 1.34617282e+02 -4.40648776e-03 1.17174829e-02 4.48063389e+01
1716.lowfreq: -1.7968 -0.0023 0.0014 0.0018 6.1478 9.3311 77.4491 131.3380 157.4680
frequency: 77.4428 131.3370 157.4679 226.8945 241.1718 260.2633 352.3726 373.1769 418.7300 450.7492 500.7462 537.5736 574.2031 599.8698 632.9002 660.8805 770.8830 789.7208 829.7629 840.2165 853.1524 894.8703 940.3927 951.1952 967.6568 1053.1904 1061.6287 1141.2461 1187.7932 1205.0487 1243.8889 1326.5112 1341.0940 1371.0501 1412.9444 1425.7065 1475.4363 1537.1617 1574.9644 1611.6094 3135.1825 3154.0672 3177.4073 3181.8236 3184.1599
redmass: 8.6309 5.1750 18.9168 5.4661 10.7818 5.9251 10.5914 13.8083 3.2077 5.1407 3.4235 7.4607 5.7793 7.9528 3.9411 7.4014 2.8578 6.3811 1.6929 1.2573 6.5166 1.5028 6.4927 1.4267 1.3255 2.0432 2.3284 1.7157 1.9453 2.2492 1.4069 4.4736 2.1121 2.8202 4.3987 2.6156 3.7074 8.8715 7.2157 7.6031 1.0907 1.0882 1.0970 1.0955 1.0936
irintensity: 0.1287 3.1471 0.1605 0.0023 0.4098 2.2148 4.7701 8.8336 12.4034 4.1238 2.1229 1.6182 0.0152 27.2328 6.6930 15.5417 1.2511 22.9380 16.8935 62.3157 45.7075 24.6933 49.6178 0.2391 1.1146 0.3536 36.5426 1.3236 4.2848 36.0688 3.9201 11.7288 25.0808 15.5101 54.8352 7.4783 65.5337 54.4862 32.5733 81.6857 19.0127 0.2839 2.2226 1.8528 1.3320
temp: 298.150 k
press: 1.00000 atm
elementType: 17 17 7 6 6 6 6 6 6 6 6 6 1 1 1 1 1
symmnumber: 1
zpe: 298082.7 jmol-1
zpe.correction: 0.113534 hartree
zpe.thermalcorrener: 0.122965 hartree
zpe.thermalcorrenthalpy: 0.123910 hartree
zpe.thermalcorrgfe: 0.077769 hartree
zpe.sumelectzpe: -1320.009933 hartree
zpe.sumelectthermal: -1320.000501 hartree
zpe.sumelectthermalent: -1319.999557 hartree
zpe.sumelectthermalfe: -1320.045698 hartree
dipole: 1.7791 -0.7857 0.0001
dipole: 1.9449
quadrupole: -81.5862 -79.6629 -85.5344
quadrupole: 6.2872 0.0014 0.0011
quadrupole: 0.6750 2.5983 -3.2733 6.2872 0.0014 0.0011
hfenergy: -1320.1234665 hartree
pointgroup: C01 [X(C9H5Cl2N1)]
dipole: 0.639237 -0.4205639 0.0000461 debye
dipolederiv: -0.3007928 0.2562858 0.0000436 0.3996021 -0.6648704 -0.0001049 0.0000418 -0.0000646 -0.0557333 -0.945827 0.0509599 0.0000326 0.1307297 -0.1192887 -0.0000114 0.0000562 -0.0000091 -0.0584767 -0.5266381 0.0479154 0.0000115 -0.0056106 -0.3494585 -0.0000197 -0.0000302 -0.0000104 -0.233855 -0.3489669 0.138746 0.0000276 0.3397471 -0.3659059 -0.000077 0.0000488 -0.0000621 0.0886669 0.4868937 0.1879402 0.0000015 -0.1922982 0.1536954 0.0000198 -0.0000171 0.0000052 0.046195 0.0921166 -0.0671149 -0.000019 0.1009774 0.0538595 0.0000197 0.000016 0.0000372 -0.1398585 0.687831 -0.298398 -0.0000516 -0.5895583 1.0881001 0.0001989 -0.0000954 0.0001491 -0.0565516 -0.4786623 -0.0830872 0.0000009 -0.0678666 -0.0290335 0.0000146 0.0000051 0.0000233 -0.0930351 -0.3717019 0.1363456 0.0000257 0.1285289 0.0477509 0.0000103 0.0000376 0.000012 -0.0935625 1.4311188 -0.1472293 -0.0000655 -0.2319215 0.1571967 0.0000307 -0.0000956 0.0000288 -0.0694105 -0.1524117 -0.0049231 0.0000082 -0.0385236 -0.6132697 -0.0000878 0.0000064 -0.0000821 -0.0703146 0.2880715 -0.1558928 0.0000064 0.1022638 0.5056522 0.0001054 0.0000452 0.0000874 -0.0624628 0.0648113 0.0648909 0.0000122 0.005182 -0.0048036 -0.00002 0.000005 -0.0000307 0.162818 0.0867344 0.0171829 0.0000045 0.0480078 0.0369064 -0.00002 0.0000093 -0.0000249 0.1675463 0.0347695 -0.0714411 -0.0000067 -0.0584613 0.0263562 -0.0000136 -0.0000087 -0.0000124 0.1633357 -0.0292963 0.0102876 -0.0000092 0.0253979 0.1113127 -0.0000132 -0.0000062 -0.0000162 0.1718148 -0.01805 -0.0824679 -0.0000227 -0.0961964 -0.0341999 -0.0000317 -0.0000181 -0.0000303 0.132884 unknown
polarizability: 195.0973592|1.0910461|132.5532536|-0.0024093|0.0122846|44.8063389 unknown
InChI: InChI=1S/C9H5Cl2N/c10-6-1-2-7-8(11)3-4-12-9(7)5-6/h1-5H
charge 0 multiplicity 1
17 atoms
Cl 2.612296 -2.301481 -0.00049
Cl -4.148576 0.238665 0.000081
N  0.742117 1.975912 0.000121
C  0.434345 -0.510727 -0.000165
C  -0.077563 0.854114 0.000019
C  -0.491593 -1.601778 -0.000235
C  1.860341 -0.643102 -0.000258
C  -1.493666 1.068601 0.000084
C  -1.867642 -1.370684 -0.00018
C  -2.349384 -0.027095 -0.000021
C  2.687713 0.475661 0.000002
C  2.071844 1.769774 0.000193
H  -0.108481 -2.626881 -0.00038
H  -1.855978 2.09953 0.000242
H  -2.577379 -2.202919 -0.000265
H  3.776436 0.381579 0.000065
H  2.704669 2.664732 0.000388
