program: Gaussian 09
title: 000006865
version: EM64L-G09RevD.01
frameworkgroup: C1[X(C10H9NO)]
method: RPBEPBE
basis: SDD
operation: Freq
keyword: #p
keyword: freq=noraman
keyword: PBEPBE/SDD
title: #p freq=noraman PBEPBE/SDD
converged: NO YES NO YES
title: Mulliken charges:
elementType: O N C C C C C C C C C C H H H H H H H H H
charge: -0.436488 -0.698385 0.225510 0.459164 0.335786 -0.324412 -0.577906 -0.489894 -0.451307 0.304891 -0.439618 -0.214282 0.192452 0.258478 0.237788 0.211417 0.217102 0.218662 0.310005 0.308765 0.352274
chargesum: 0.00000
title: Mulliken charges with hydrogens summed into heavy atoms:
elementType: O N C C C C C C C C C C
charge: -0.084214 -0.079615 0.225510 0.459164 0.335786 -0.131961 -0.319428 -0.252106 -0.239891 0.304891 -0.222517 0.004380
polarizability: 1.83219656e+02 -7.56018566e+00 1.37752144e+02 2.11667075e-04 3.76905573e-03 4.76865283e+01
1716.lowfreq: -15.7840 -5.8749 -0.0010 -0.0009 -0.0004 7.5417 87.6691 128.2204 246.7732
frequency: 87.6487 128.2170 246.7731 248.5462 267.1917 298.9711 312.6030 350.9135 385.7417 431.5438 449.4557 459.9270 493.2059 508.1228 574.4226 608.0125 640.8961 687.4370 714.4955 744.8492 770.4267 807.1570 838.2878 852.9357 899.8881 909.5042 938.4092 964.9860 987.8050 1086.3075 1106.1340 1147.2019 1166.1248 1180.4519 1195.9442 1256.5155 1270.6814 1315.6513 1387.5916 1411.6003 1416.9455 1458.9948 1472.7179 1530.2771 1594.5689 1604.6674 1643.4758 1647.1147 3106.8806 3116.9132 3132.5655 3133.8632 3154.6345 3157.0852 3578.5517 3584.3996 3717.9752
redmass: 3.2278 3.8842 3.6296 4.5594 1.2967 5.1183 1.0922 4.8940 1.2202 2.3817 5.2142 3.8173 4.8345 3.0299 6.6660 4.5368 2.5647 5.4378 6.1976 1.6307 1.3269 2.8475 5.1021 1.4536 1.6890 1.3816 3.4786 1.3405 2.0665 2.3554 1.6902 1.3436 1.2842 1.3381 1.4657 2.2031 1.8993 1.8425 3.3536 2.6642 6.2660 3.5227 2.8693 4.3646 5.8239 5.7523 1.3239 4.5682 1.0857 1.0863 1.0955 1.0916 1.0972 1.0943 1.0454 1.0661 1.1029
irintensity: 5.7095 0.0116 4.7561 1.0964 136.1770 7.8771 121.0446 14.7781 162.7095 0.6824 1.4216 0.3014 0.1206 10.4497 1.6544 0.4117 5.2100 10.0867 2.2854 3.8886 127.2572 0.1229 23.7631 17.8551 28.0182 5.9870 51.7644 3.9980 0.1182 20.4889 0.2351 230.8110 2.7294 15.0923 5.7345 31.1461 50.7356 46.6868 6.0388 3.0382 36.2259 113.9924 9.4075 23.4909 112.7051 5.1959 250.6511 101.5659 10.3499 13.2824 29.4609 24.0440 23.9163 11.7593 56.2366 44.3852 18.6111
temp: 298.150 k
press: 1.00000 atm
elementType: 8 7 6 6 6 6 6 6 6 6 6 6 1 1 1 1 1 1 1 1 1
symmnumber: 1
zpe: 431757.4 jmol-1
zpe.correction: 0.164448 hartree
zpe.thermalcorrener: 0.174451 hartree
zpe.thermalcorrenthalpy: 0.175395 hartree
zpe.thermalcorrgfe: 0.129688 hartree
zpe.sumelectzpe: -515.610998 hartree
zpe.sumelectthermal: -515.600995 hartree
zpe.sumelectthermalent: -515.600050 hartree
zpe.sumelectthermalfe: -515.645758 hartree
dipole: 0.9352 3.6269 0.0022
dipole: 3.7456
quadrupole: -56.4347 -57.1581 -77.0669
quadrupole: -2.9951 0.0047 0.0067
quadrupole: 7.1186 6.3951 -13.5137 -2.9951 0.0047 0.0067
hfenergy: -515.7754456 hartree
pointgroup: C01 [X(C10H9N1O1)]
dipole: 0.3178057 1.4389415 0.0008617 debye
dipolederiv: -1.6488584 -0.0776679 0.0000002 -0.288417 -0.0803964 0.0000382 -0.0000523 0.0000295 -0.4283796 -0.3680602 -0.4179738 -0.0001468 -0.6435759 -1.2659887 0.0003261 0.0002633 0.0009359 -0.717467 -0.2367073 -0.2884641 0.0000069 0.1299267 -0.2666203 -0.0000078 0.0000609 0.0000617 -0.0419613 0.4705703 -0.0166786 -0.0000179 -0.3479186 0.1015724 0.0000196 -0.0000516 0.0000105 0.0778501 0.3539376 0.3136253 0.000051 0.7335948 1.334783 -0.0000694 0.0000706 -0.0000918 0.1316373 0.2277502 -0.0544936 -0.0000319 -0.0957939 0.0643537 -0.0000439 -0.0000693 -0.0000995 -0.1430739 -0.5104058 0.0017223 -0.0000044 0.3088334 0.0453265 -0.0000015 0.0000272 0.0000025 -0.2047631 -0.4998215 -0.0184684 -0.0000032 0.1304282 -0.047451 0.0000077 -0.0000072 0.0000225 -0.2644227 0.0348392 0.3156244 0.0000263 -0.3313136 -0.539534 0.0000005 -0.0001088 -0.0001183 -0.2739126 1.6055979 0.09238 -0.0000079 0.1423076 0.1310522 -0.0000238 0.0000079 0.0000031 0.0716438 -0.3767084 -0.0443566 0.0000261 -0.2300776 -0.0087484 -0.0000228 0.0000316 -0.000033 -0.2140742 0.3197914 0.0698236 -0.0000072 0.2744723 0.3323429 0.0000213 0.0000074 0.0000409 -0.1202324 0.0488446 -0.1012722 0.0000019 -0.044464 -0.126087 0.000014 0.000003 0.0000598 0.1494682 0.0713351 -0.0144593 0.0000002 -0.0724037 -0.0446903 0.0000003 0.0000111 -0.0000072 0.1711615 0.0444069 -0.093097 -0.0000042 -0.0232729 -0.089981 -0.0000118 0.0000148 -0.000017 0.1738522 -0.1562385 -0.0504273 -0.0000257 -0.0847435 0.0527817 -0.0000093 -0.0000306 -0.0000248 0.1758289 -0.0721231 0.1136369 -0.0000091 0.1013218 -0.0136312 0.0000152 -0.0000222 0.0000168 0.1737324 -0.0209082 0.1280591 0.0000098 0.1264509 -0.0398259 -0.0000163 0.0000219 -0.0000023 0.1525306 0.1480972 0.058433 0.0001548 0.0632332 0.1996582 -0.0001229 0.0000149 -0.0005203 0.3682669 0.1470961 0.0486096 -0.0000192 0.0541798 0.1887323 -0.0000886 -0.0002167 -0.0002459 0.3790597 0.4175648 0.0354446 0.0000003 0.0972319 0.0723512 -0.0000248 0.0000241 -0.0000232 0.3832552 unknown
polarizability: 183.6924718|-5.9527395|137.2793282|0.0000797|0.0037742|47.6865283 unknown
InChI: InChI=1S/C10H9NO/c11-10-3-1-2-7-6-8(12)4-5-9(7)10/h1-6,12H,11H2
charge 0 multiplicity 1
21 atoms
O  -3.773374 -0.396429 -0.000053
N  2.303247 2.100922 0.000062
C  0.388568 0.531009 -0.000039
C  -0.075572 -0.846141 -0.000071
C  1.817138 0.792691 0.000036
C  -0.59251 1.573639 -0.000091
C  -1.482525 -1.109431 -0.000049
C  0.875343 -1.919328 -0.000136
C  2.717763 -0.292636 -0.00005
C  -2.405461 -0.063474 -0.00004
C  -1.961371 1.296702 -0.000096
C  2.242751 -1.63356 -0.00016
H  -0.289199 2.627199 -0.000251
H  -1.845412 -2.142197 -0.000054
H  0.516193 -2.953891 -0.000177
H  3.797325 -0.098379 -0.000014
H  -2.69254 2.115862 -0.000172
H  2.971679 -2.452246 -0.000222
H  1.687038 2.905577 0.001027
H  3.305032 2.267826 0.000326
H  -4.333514 0.418784 0.000024
