program: TURBOMOLE
programVersion: 7.3
elementType: v
basis: def2-TZVP
elementType: o
elementType: c
elementType: h
elementType: f
method: uhf
method: dft
functional: b3-lyp
elementType: v o c h f
basis: def2-TZVP def2-TZVP def2-TZVP def2-TZVP def2-TZVP
correction: disp3
energy: -8929.626497550 hartree
formula: C42H100FO20V6
InChI: InChI=1/2C3H8O.12C3H7O.F.6O.6V/c14*1-2-3-4;;;;;;;;;;;;;/h2*4H,2-3H2,1H3;12*2-3H2,1H3;;;;;;;;;;;;;/q;;;;;;;;;;;;2*-1;;;;;;;;;;;;;+2/rC42H100FO20V6/c1-15-29-50-64(44,51-30-16-2)54(33-19-5)65(45,55(64)34-20-6)56(35-21-7)66(46,57(65)36-22-8)58(37-23-9)67(47,59(66)38-24-10)60(39-25-11)69(49,61(67)40-26-12)43-68(48,52-31-17-3,53-32-18-4,62(69)41-27-13)63(69)42-28-14/h52-53H,15-42H2,1-14H3
169 atoms
V  -1.20913632 -3.10156768 -0.05105268
V  1.81708118 2.7959333 -0.08913717
V  -3.5512312 -1.0102208 0.10508626
V  3.23263032 0.28211429 0.08569347
V  -3.12149827 2.07343568 0.52903849
V  1.88738196 -2.51778381 -0.01983329
O  -1.64197695 -4.60997288 -0.12684875
O  -5.00530123 -1.58231357 -0.08233727
O  4.79294391 0.15652334 0.31865447
O  -4.41821226 2.96133863 0.68802163
O  2.7929807 -3.8002043 -0.13120875
O  0.37257265 -3.09820758 1.17215364
O  -2.05200809 3.18830924 -0.69150083
O  -2.32224549 -2.07935958 1.20749592
O  3.03209011 1.71999382 -1.28876009
O  -2.51732551 -2.12401826 -1.21146732
O  2.91835295 1.90040905 1.32104908
O  -3.72847483 0.37770505 1.49919651
O  2.787431 -1.19182983 -1.18773793
O  -3.16202935 0.64349124 -0.85500796
O  2.5513725 -1.21037562 1.24505031
O  -1.74221431 2.35792527 1.81543128
O  0.30275798 -2.63556176 -1.19963813
O  2.55322179 4.17049885 -0.36079926
C  2.49925182 -1.06053448 2.64054436
C  3.84402929 -1.37406736 3.27116201
H  1.71265733 -1.70637923 3.045663
H  2.21649463 -0.02679869 2.85948297
C  4.27890861 -2.81725969 3.08283098
H  4.58387399 -0.70753392 2.81708079
H  3.7904024 -1.12147666 4.33701039
H  5.29078092 -2.97933843 3.46255194
H  3.61400698 -3.50726552 3.61195038
H  4.26842872 -3.08853368 2.0251909
C  -1.59650187 1.79633319 3.09002368
C  -0.41635444 0.84747207 3.17023815
H  -2.50095062 1.25424001 3.38137727
H  -1.46624872 2.60411357 3.82802579
C  -0.28226319 0.26211009 4.5643562
H  -0.54650958 0.06183658 2.42101304
H  0.4986572 1.36949626 2.87856816
H  0.56051328 -0.42768673 4.63421958
H  -0.12709165 1.04879808 5.30958411
H  -1.18441093 -0.28690929 4.85244399
C  -2.24007921 -2.15585405 2.61620517
C  -2.87215997 -3.43412184 3.13133707
H  -2.73265512 -1.2751376 3.0355171
H  -1.18662493 -2.10192727 2.90136876
C  -4.36368268 -3.52519961 2.85881157
H  -2.36405617 -4.28315931 2.66108365
H  -2.67178635 -3.49977252 4.20721554
H  -4.76873982 -4.47999873 3.20195904
H  -4.91048116 -2.72732112 3.36919927
H  -4.5728556 -3.43523335 1.7915286
C  -4.72731993 0.43802822 2.49383432
C  -6.13845068 0.56962008 1.95581073
H  -4.51535782 1.29820149 3.14223276
H  -4.66209556 -0.46041242 3.12380457
C  -7.14376368 0.67109314 3.09060518
H  -6.17966127 1.46005112 1.32445078
H  -6.35955349 -0.29242888 1.32347008
H  -8.16303808 0.7608419 2.70816283
H  -7.1107493 -0.21373691 3.73478773
H  -6.94829726 1.54545519 3.71902604
C  3.86059738 2.47317433 2.18312724
C  5.04850641 3.12296547 1.49852601
H  4.22376403 1.69141423 2.86603847
H  3.35585358 3.22480153 2.8086117
C  5.96909585 3.79156 2.50476671
H  5.5832146 2.35115757 0.94119053
H  4.67347306 3.85106668 0.77427549
H  6.83066261 4.25065813 2.0139299
H  5.44746445 4.57800829 3.06005469
H  6.3508129 3.07075569 3.23498202
C  0.62427136 -4.01341842 2.22143773
C  0.7502504 -5.45607475 1.7752648
H  -0.17177613 -3.92922225 2.97108733
H  1.55497009 -3.71714303 2.71664303
C  1.08961707 -6.3542691 2.95322294
H  -0.18418743 -5.77121223 1.30661458
H  1.53057849 -5.51286933 1.0126945
H  2.04125669 -6.06716041 3.41100676
H  0.31978628 -6.30279412 3.72995323
H  1.17452814 -7.39786568 2.64237796
C  0.32482857 -2.37797056 -2.58719238
C  0.80453338 -3.58899309 -3.36423157
H  0.98181271 -1.5255345 -2.75761751
H  -0.67602743 -2.07556228 -2.90325946
C  -0.12754125 -4.78590681 -3.2832997
H  0.94864813 -3.28435061 -4.40784976
H  1.79025969 -3.86987287 -2.97745043
H  -1.10498166 -4.5607694 -3.71975143
H  0.28591079 -5.64232757 -3.8212483
H  -0.29084859 -5.0867965 -2.24725421
C  3.78430071 2.20773533 -2.35849057
C  5.27613652 1.97351442 -2.22644932
H  3.60073758 3.286465 -2.45059783
H  3.42905495 1.74228761 -3.2948058
C  6.02254203 2.44643904 -3.46153993
H  5.63373338 2.49490831 -1.33564997
H  5.46375255 0.91174374 -2.04711009
H  7.0987724 2.2874328 -3.36157707
H  5.69017516 1.90832515 -4.35516168
H  5.85912739 3.51347622 -3.64103967
C  -3.08649178 0.81862667 -2.25096911
C  -4.46296984 1.0005397 -2.85290877
H  -2.58110578 -0.04788008 -2.68963674
H  -2.47243843 1.70007283 -2.45024534
C  -4.39920077 1.12464575 -4.36497158
H  -5.09272619 0.15343464 -2.55908419
H  -4.91658776 1.89228645 -2.40823335
H  -5.39243847 1.2647341 -4.79683541
H  -3.78362081 1.97757312 -4.66544506
H  -3.96249174 0.22836961 -4.816192
C  -2.14313186 4.58719809 -0.55499588
C  -3.27223651 5.16567247 -1.38878945
H  -1.18806933 5.02972392 -0.87162576
H  -2.2836338 4.86356978 0.4986413
C  -3.09566028 4.90556327 -2.87472806
H  -4.21283484 4.73349413 -1.03569919
H  -3.32112679 6.24440094 -1.19684873
H  -3.06327679 3.83197429 -3.07124139
H  -3.91651855 5.3276262 -3.46054964
H  -2.16009245 5.33786479 -3.24409952
C  -3.18606754 -2.61481487 -2.35755277
C  -4.00535572 -3.86540858 -2.11485686
H  -2.44983033 -2.81277179 -3.14631386
H  -3.84676388 -1.82545948 -2.73609982
C  -4.72530944 -4.29121681 -3.38337917
H  -3.34755768 -4.66100356 -1.7596012
H  -4.72350404 -3.65766266 -1.31821998
H  -5.40740887 -3.51121442 -3.73528053
H  -4.01824672 -4.50210643 -4.19222405
H  -5.3143082 -5.19590045 -3.21799353
C  3.5629023 -1.42109564 -2.33902738
C  4.89100917 -2.09060728 -2.04774209
H  3.73066533 -0.45728192 -2.83541118
H  2.99558352 -2.03993759 -3.0448416
C  5.71188315 -2.25443761 -3.31534799
H  5.42939486 -1.48769191 -1.31226768
H  4.69497065 -3.0596337 -1.58115698
H  6.66524697 -2.74658532 -3.11021017
H  5.18225776 -2.85690627 -4.0604446
H  5.93248726 -1.28436809 -3.77239031
O  0.28097979 2.93839434 -1.41048805
O  0.40638464 3.47488083 1.25473281
H  -0.71358582 2.95860533 -1.06549708
H  -0.48800331 2.96608873 1.38620626
C  0.65081124 4.20081874 2.44893723
C  1.43656163 5.47031554 2.20729833
H  1.17767524 3.560158 3.16733335
H  -0.32670317 4.45036224 2.87773237
C  0.7598046 6.41286077 1.22934962
H  1.56862888 5.95206975 3.18346315
H  2.43228344 5.21690164 1.83592597
H  0.70046922 5.94682135 0.2457437
H  -0.2554827 6.66191017 1.55337359
H  1.32326898 7.3433243 1.12714186
C  0.32553727 2.58316988 -2.77497471
C  0.40347444 1.08852157 -3.00591421
H  1.19232013 3.08135218 -3.22232883
H  -0.57001908 2.99555832 -3.25885891
C  0.29009359 0.7584605 -4.48312783
H  1.33727907 0.72004661 -2.57855888
H  -0.39052105 0.60234597 -2.43571274
H  -0.67048084 1.08768137 -4.89328067
H  1.08007247 1.24846721 -5.0612108
H  0.37330675 -0.31566937 -4.66238116
F  1.16753144 0.82688777 0.06238298
empdispcorrection: -0.353730653 hartree
energy: -8929.6264975501508
energyOcCorr: -8929.6303997405
elementType: v o c
s2: 12.05845659
charge: -1.000000
dipole: -79.582881 79.268880 -0.314001 -1.069909 0.454019 -0.615889 11.932614 -11.890472 0.042142
quadrupole: 24591.067667 -25035.842446 -444.774779 20012.537940 -20438.222841 -425.684901 11090.093634 -11448.646925 -358.553290 1548.757550 -1545.029557 3.727993 -510.532270 511.420512 0.888242 55.694739 -54.835757 0.858982
