program: TURBOMOLE
programVersion: 7.3
elementType: v
basis: def2-TZVP
elementType: o
elementType: c
elementType: h
method: uhf
method: dft
functional: b3-lyp
elementType: v o c h
basis: def2-TZVP def2-TZVP def2-TZVP def2-TZVP
correction: disp3
energy: -8440.941274691 hartree
formula: C36H84O18V6
InChI: InChI=1/12C3H7O.6O.6V/c12*1-2-3-4;;;;;;;;;;;;/h12*2-3H2,1H3;;;;;;;;;;;;/rC36H84O18V6/c1-13-25-43-55(37)44(26-14-2)56(43,38)47(29-17-5)58(40,48(56)30-18-6)51(33-21-9)60(42,52(58)34-22-10)53(35-23-11)59(41,54(60)36-24-12)49(31-19-7)57(39,45(55)27-15-3,46(55)28-16-4)50(59)32-20-8/h13-36H2,1-12H3
144 atoms
V  3.07360209 0.56990557 0.02737939
V  -3.07577959 -0.54975848 0.0018278
V  1.04364469 2.94708844 0.04552498
V  -1.04705319 -2.93788824 -0.03494658
V  -2.0352442 2.40015796 0.06065518
V  2.0286511 -2.37266007 -0.0051475
O  4.61610708 0.84903567 0.04985788
O  1.59563687 4.41454566 0.03288069
O  -1.58442608 -4.40980996 -0.07249887
O  -3.02892921 3.61162038 0.11766296
O  3.0400936 -3.57093879 0.0049224
O  2.88567796 -1.0064338 -1.17737454
O  -2.86876617 1.0057726 1.22477662
O  1.95400723 1.68178974 -1.15092985
O  -1.98242002 -1.69746203 1.17330804
O  2.30887969 1.97103532 1.22756072
O  -2.29532459 -1.92541324 -1.21361052
O  -0.56872078 3.01772631 -1.13232415
O  0.54498618 -2.99663042 1.16644934
O  -0.47179161 2.5433681 1.24012721
O  0.48431111 -2.5387786 -1.20964712
O  -2.47638043 0.91809534 -1.16151074
O  2.43594154 -0.87055426 1.20024423
O  -4.61819778 -0.82954307 -0.02285979
C  0.43196873 -2.37838616 -2.61572217
C  0.38101795 -3.72150243 -3.31612659
H  1.30703608 -1.80390279 -2.92901534
H  -0.45150802 -1.7817714 -2.85680717
C  1.63965006 -4.55221931 -3.13574456
H  -0.48069731 -4.27727201 -2.92994414
H  0.18882173 -3.5412163 -4.37973598
H  2.50786141 -4.0603141 -3.58291349
H  1.85870287 -4.71462704 -2.07906528
H  1.53421479 -5.52996152 -3.60974597
C  -2.38884626 0.85880576 -2.57316169
C  -3.75641072 1.0071423 -3.20972283
H  -1.93425114 -0.09684526 -2.84676048
H  -1.71306343 1.64770845 -2.91138255
C  -4.39287057 2.36562697 -2.97221043
H  -3.65315996 0.81323668 -4.28319621
H  -4.40889536 0.22381891 -2.8082477
H  -5.39570777 2.40818965 -3.40135956
H  -4.47635984 2.58230848 -1.90578605
H  -3.8039326 3.16606095 -3.42875255
C  1.7847811 1.61644496 -2.55626199
C  2.56672659 2.71507773 -3.24801422
H  0.71657582 1.70326833 -2.7728044
H  2.10924537 0.62898845 -2.89439646
C  4.07133749 2.58630488 -3.08615328
H  2.2924145 2.71011243 -4.3088058
H  2.23789172 3.67789355 -2.84148818
H  4.44487455 1.67286064 -3.5571881
H  4.58848589 3.42987975 -3.5472719
H  4.35509908 2.55692929 -2.0324769
C  -0.78095429 3.97447594 -2.16021985
C  -0.94592863 5.39272228 -1.65723385
H  -1.68097084 3.68707495 -2.71584703
H  0.05928458 3.92260975 -2.86231657
C  -1.21638112 6.3460139 -2.80944769
H  -1.7726491 5.41303397 -0.94304833
H  -0.04195729 5.68723846 -1.12034786
H  -0.39643874 6.3407133 -3.5337717
H  -2.13313266 6.07802771 -3.34292768
H  -1.33180088 7.37046129 -2.45118613
C  -3.00166982 -2.52033661 -2.29364059
C  -4.11372318 -3.45136034 -1.85994167
H  -2.2852965 -3.07007909 -2.91400755
H  -3.41631905 -1.72167822 -2.91863615
C  -4.8184977 -4.0498756 -3.06602429
H  -3.68795455 -4.23958013 -1.23508531
H  -4.82056 -2.89135926 -1.24347501
H  -5.62161868 -4.72111404 -2.75687652
H  -5.26214693 -3.27322221 -3.69606785
H  -4.12724477 -4.62698368 -3.68732175
C  3.82251389 -1.31545428 -2.19859463
C  5.15521267 -1.81844488 -1.68638814
H  3.98139103 -0.41435704 -2.802342
H  3.37826497 -2.07096038 -2.85741327
C  6.09815569 -2.11588057 -2.84048368
H  5.5856123 -1.06236048 -1.0260631
H  4.98599763 -2.71769713 -1.09024207
H  6.29087732 -1.22128822 -3.44002015
H  7.05994122 -2.48089132 -2.47596562
H  5.68669646 -2.88046046 -3.50620992
C  2.30236439 -0.77612969 2.60755817
C  3.65085336 -0.89607645 3.2888836
H  1.62392806 -1.56436309 2.94275464
H  1.83148698 0.18270383 2.83969218
C  4.3033241 -2.25595601 3.11016237
H  4.3095134 -0.11952875 2.88441186
H  3.51447651 -0.67171964 4.35270029
H  5.29585021 -2.2766397 3.5641895
H  3.70947264 -3.0458749 3.57841809
H  4.41338686 -2.50565961 2.05341989
C  -1.83775518 -1.67111004 2.58184948
C  -2.61984867 -2.7969906 3.22837113
H  -2.17975054 -0.69933192 2.94602374
H  -0.77288459 -1.75081561 2.81558219
C  -4.12263177 -2.67570784 3.0444364
H  -2.2753475 -3.74463962 2.7995122
H  -2.36334267 -2.82078849 4.29337831
H  -4.51172232 -1.7793473 3.53543781
H  -4.38787497 -2.61680007 1.98730332
H  -4.64043437 -3.53655041 3.47165183
C  -0.5033872 2.37072936 2.64553576
C  -1.08169817 3.59420588 3.32808869
H  0.5143137 2.17514554 2.99168232
H  -1.10080186 1.48184342 2.86498517
C  -0.23437751 4.84271899 3.15436655
H  -2.08274258 3.77390521 2.92049535
H  -1.21025002 3.36107418 4.39093487
H  -0.71795732 5.71039915 3.60702608
H  0.74542591 4.72723884 3.62610667
H  -0.07059727 5.06516231 2.09830047
C  -3.7916777 1.2648805 2.27291781
C  -5.11245979 1.83521588 1.80194539
H  -3.32328879 1.95108473 2.98806882
H  -3.97785983 0.32506627 2.80519629
C  -6.05983701 2.04201589 2.97202383
H  -4.92783376 2.7800963 1.28676189
H  -5.54845951 1.14531865 1.07528048
H  -7.01133243 2.45831163 2.63659126
H  -6.27439863 1.09913287 3.48358013
H  -5.63987678 2.73256802 3.70946764
C  3.00559642 2.62197397 2.2800046
C  4.15961576 3.48381943 1.81438878
H  3.36787007 1.86122416 2.98115452
H  2.2911678 3.24753902 2.82739899
C  4.8219527 4.18023815 2.99160762
H  4.88026088 2.85775768 1.2842836
H  3.77779881 4.21862664 1.10168547
H  5.21272595 3.45856964 3.71517624
H  5.65772467 4.79917101 2.66062565
H  4.11785437 4.8311762 3.51827031
C  0.7589062 -3.94476094 2.20211873
C  0.92645783 -5.36615118 1.70937653
H  -0.08180687 -3.89128017 2.90340385
H  1.65761385 -3.64952636 2.75565741
C  1.17955664 -6.31367241 2.87024137
H  0.02870149 -5.66080367 1.16190114
H  1.7622604 -5.39318397 1.0062361
H  2.08920037 -6.04403672 3.41487866
H  0.34964416 -6.30322902 3.58308269
H  1.29839759 -7.34019071 2.51910681
empdispcorrection: -0.293455035 hartree
energy: -8440.9412746908092
energyOcCorr: -8440.9409621814
elementType: v o c
s2: 12.05668543
charge: -0.000000
dipole: 5.283131 -5.345098 -0.061967 12.979592 -12.976686 0.002906 18.398811 -18.394595 0.004216
quadrupole: 17941.946652 -18293.407564 -351.460912 17775.876770 -18127.171216 -351.294446 8743.871474 -9030.839919 -286.968444 -241.763481 241.834502 0.071022 -18.456370 18.687165 0.230795 124.599442 -125.457709 -0.858267
