program: Gaussian 09
title: 000050347
version: EM64L-G09RevD.01
frameworkgroup: C1[X(C25H26N4O4S)]
method: RPBEPBE
basis: SDD
operation: Freq
keyword: #p
keyword: freq=noraman
keyword: PBEPBE/SDD
title: #p freq=noraman PBEPBE/SDD
converged: YES YES NO NO
title: Mulliken charges:
elementType: S O O O O N N N N C C C C C C C C C C C C C C C C C C C C C C C C C H H H H H H H H H H H H H H H H H H H H H H H H H H
charge: 0.955568 -0.540042 -0.554664 -0.320716 -0.296905 -0.482349 -0.486827 -0.163361 -0.636027 -0.616148 0.221058 -0.284461 0.272161 0.204228 -0.091317 -0.342914 0.270987 -0.037381 0.299452 0.158771 0.189543 -0.394779 -0.411305 -0.276042 -0.404955 -0.330821 -0.682893 -0.331400 -0.385930 -0.258457 -0.269405 -0.229362 0.127668 -0.529884 0.265602 0.262677 0.235944 0.227428 0.201805 0.197089 0.351121 0.269051 0.233668 0.303517 0.271776 0.232054 0.269986 0.216966 0.221427 0.218237 0.256811 0.291163 0.236025 0.232477 0.235866 0.234057 0.248182 0.243717 0.312906 0.389358
chargesum: 0.00000
title: Mulliken charges with hydrogens summed into heavy atoms:
elementType: S O O O O N N N N C C C C C C C C C C C C C C C C C C C C C C C C C
charge: 0.955568 -0.540042 -0.554664 -0.320716 -0.296905 -0.131228 -0.217776 -0.163361 0.066236 -0.087869 0.221058 0.178911 0.272161 0.204228 -0.091317 0.055980 0.270987 -0.037381 0.299452 0.158771 0.189543 -0.161111 -0.107788 -0.004266 -0.172901 -0.060834 -0.026263 -0.074590 -0.094767 -0.022432 -0.036928 0.006504 0.127668 0.196072
polarizability: 7.64933136e+02 -1.39795220e+01 4.05879344e+02 1.63858618e+01 -2.18603824e+01 2.22710687e+02
1716.lowfreq: -8.6958 0.0003 0.0009 0.0012 1.4576 2.7407 8.1555 10.5489 17.3317
frequency: 7.6742 9.7095 17.2601 17.7855 31.8472 34.1204 50.3604 60.3885 64.4632 68.2806 78.9742 103.0237 106.5473 112.8386 116.5596 125.7788 135.1594 158.0186 164.0785 170.4406 178.6842 187.7416 212.4920 218.6957 227.6395 244.8926 251.9504 257.6557 274.3959 287.9104 309.2566 328.4331 341.2758 342.1238 356.8225 377.5751 394.2166 403.2670 414.2378 439.8079 450.5597 463.4841 466.9181 481.4194 505.9642 511.3272 532.7223 541.5445 558.7079 559.7264 579.5782 588.4428 600.9521 617.5649 623.6244 641.3512 649.1960 666.6633 705.7069 710.9602 718.7111 727.3473 744.7841 754.8851 768.1392 771.4685 779.6455 780.7555 797.6818 804.4538 813.1074 832.6206 838.5058 858.3474 864.7814 873.2355 889.4695 891.8097 895.1781 899.2092 925.4653 931.3242 950.0224 954.0945 968.4083 969.7524 993.7363 1001.2972 1006.2487 1023.7739 1024.6861 1057.6458 1064.9649 1073.0393 1086.3822 1094.6133 1116.6447 1119.1601 1131.3442 1152.2048 1154.4570 1165.8581 1175.3144 1183.5389 1185.4856 1200.0605 1205.2923 1215.2651 1221.0890 1253.9509 1266.6978 1272.2499 1282.4575 1290.2164 1293.9463 1301.3171 1311.3674 1339.7139 1342.9157 1351.5887 1367.0505 1391.1394 1392.4266 1402.6566 1410.4341 1419.6222 1431.8209 1435.5644 1452.3815 1453.1440 1466.4177 1468.3058 1471.5096 1473.9728 1476.8384 1477.2427 1484.6647 1488.5884 1512.7374 1527.3279 1546.5827 1556.2436 1566.8991 1578.6110 1590.3504 1605.4367 1620.8524 1633.0421 2974.1759 2979.1570 2981.2165 3000.6561 3021.2243 3034.8959 3063.9355 3075.4412 3080.7905 3081.3958 3126.2936 3129.1968 3133.4493 3134.9636 3136.5199 3147.5697 3148.4662 3164.7162 3164.8573 3169.4556 3171.1240 3175.0498 3190.4279 3350.4679 3471.5262 3609.4267
redmass: 4.8320 4.0409 4.8314 3.6502 4.4918 4.5119 6.2343 2.4236 5.5134 5.5367 5.5917 4.1143 2.5870 3.8858 4.8654 7.2526 5.1473 5.2223 6.4247 4.4595 4.1209 6.2712 2.0717 3.2483 1.6717 1.7868 4.9522 2.3852 4.9570 3.7742 5.3125 6.3682 6.3327 6.3487 5.3551 4.5714 3.6560 4.0824 4.2692 4.7058 3.9622 6.1057 5.3131 3.2630 6.0291 3.2353 7.2255 4.6127 4.9956 5.8133 3.4699 4.0594 2.1110 3.4525 2.0439 3.7804 2.0431 4.7043 5.2655 6.0815 3.8538 4.7616 1.0721 2.9000 2.9124 1.8926 1.2167 2.0080 1.5653 3.2661 5.2888 1.8823 3.2256 1.6317 2.8056 2.0999 1.7084 1.7061 5.2136 1.1555 2.2321 1.8861 2.8057 1.3866 1.4600 4.3648 1.3257 4.0105 1.3779 3.8519 2.1577 1.2577 2.7549 2.0073 3.8455 2.1672 1.3431 1.8916 2.3564 1.7374 1.3794 1.2980 1.9637 1.2095 1.1931 1.5300 1.4739 1.2912 1.8425 3.1941 1.7748 1.2120 2.1857 1.0716 4.2440 1.2873 2.3596 1.4282 2.3974 2.5514 3.1608 3.8080 1.2123 4.0337 1.1122 2.9432 1.8076 3.7709 2.3080 2.8508 1.2012 1.5457 1.0696 1.5991 1.0643 1.0419 1.7151 1.0836 3.9060 5.4068 4.5583 3.3686 1.9519 3.8140 5.3231 6.5727 5.8061 7.1533 1.0583 1.0318 1.0363 1.0593 1.1013 1.0546 1.1038 1.1049 1.1000 1.1010 1.1105 1.0898 1.0861 1.0858 1.1018 1.0912 1.0892 1.0944 1.0986 1.0698 1.0948 1.0987 1.0922 1.0753 1.0742 1.0868
irintensity: 0.2645 0.7480 2.8316 0.8466 0.4061 0.5009 1.5925 1.1172 2.7177 3.9442 10.4092 8.5577 1.5886 5.0769 44.2526 32.1579 5.6119 2.3104 16.1109 0.4493 5.8065 18.6146 5.0402 4.4426 0.9637 2.3562 0.8450 6.0888 7.5578 17.6321 5.8300 25.1680 2.1329 16.1452 57.6107 12.8223 8.9407 65.5313 11.4497 6.0068 20.3798 23.0892 16.1073 14.5207 0.0540 4.7025 6.3693 11.9099 9.9261 9.0165 8.2931 12.0410 95.0927 14.1693 68.7419 28.2208 127.1780 20.0957 5.8618 23.5081 9.5338 12.4387 6.1104 85.7183 4.6205 58.1325 1.2688 6.7828 13.3215 107.8627 8.4462 173.2826 16.9538 28.3989 3.4063 8.9508 13.4643 11.3799 13.4730 94.3808 1.3513 1.8126 46.9824 3.1070 2.6303 2.8831 0.7095 64.0409 2.4514 1.7262 5.5723 4.9191 2.2137 12.6229 12.9115 87.4763 12.5939 64.6576 6.9348 4.2002 2.4525 8.8401 61.2338 4.3004 12.0123 1.0386 8.0553 11.0801 8.8641 18.7572 16.3363 0.4641 28.7851 1.8886 22.6754 18.2813 32.5666 22.7107 342.4334 42.7703 29.4790 75.9307 8.6130 35.9731 7.6805 18.0923 52.9111 152.1407 1.0682 1.1816 40.0695 34.8343 3.1088 141.6380 0.7743 13.7245 201.9471 18.9680 676.8162 139.4211 260.8091 270.3998 37.8192 47.0881 41.4933 241.6690 125.6114 85.8773 21.3554 47.5840 42.5175 25.9561 11.6884 7.4357 2.3477 25.1113 45.4737 49.8447 5.5540 9.3307 2.8397 2.8965 15.2254 3.0841 14.1994 84.9430 20.8800 652.4371 2.5934 15.9979 1.1897 16.8978 66.9300 98.5450
temp: 298.150 k
press: 1.00000 atm
elementType: 16 8 8 8 8 7 7 7 7 6 6 6 6 6 6 6 6 6 6 6 6 6 6 6 6 6 6 6 6 6 6 6 6 6 1 1 1 1 1 1 1 1 1 1 1 1 1 1 1 1 1 1 1 1 1 1 1 1 1 1
symmnumber: 1
zpe: 1223294.0 jmol-1
zpe.correction: 0.465928 hartree
zpe.thermalcorrener: 0.499020 hartree
zpe.thermalcorrenthalpy: 0.499964 hartree
zpe.thermalcorrgfe: 0.395967 hartree
zpe.sumelectzpe: -1883.651127 hartree
zpe.sumelectthermal: -1883.618036 hartree
zpe.sumelectthermalent: -1883.617091 hartree
zpe.sumelectthermalfe: -1883.721089 hartree
dipole: -3.2687 4.8411 1.4899
dipole: 6.0283
quadrupole: -301.5341 -181.4022 -205.1459
quadrupole: -19.1617 -8.9567 -14.1415
quadrupole: -72.1734 47.9586 24.2148 -19.1617 -8.9567 -14.1415
hfenergy: -1884.1170554 hartree
pointgroup: C01 [X(C25H26N4O4S1)]
dipole: 1.2059663 -2.0422107 -0.0002496 debye
polarizability: 761.8802097|-21.9812331|381.8359871|-34.2222166|68.4544644|249.80697 unknown
InChI: InChI=1S/C25H26N4O4S/c1-3-4-14-34(31,32)29-16-12-13-21(22(15-16)33-2)28-23-17-8-5-6-11-20(17)27-24-18(23)9-7-10-19(24)25(26)30/h5-13,15,28-29H,3-4,14,26H2,1-2H3
charge 0 multiplicity 1
60 atoms
S  5.980709 0.899997 -0.894043
O  7.28995 1.325955 -1.760983
O  5.896406 1.20138 0.706281
O  1.235917 1.920364 2.052904
O  -7.979471 0.905041 0.1287
N  -0.620872 0.722094 0.655365
N  4.384304 1.906957 -1.714985
N  -4.2722 -1.123727 -0.600354
N  -6.945357 -1.012629 -0.700033
C  5.73091 -1.03986 -1.106159
C  -1.798974 0.092755 0.204411
C  6.673247 -1.783586 -0.160565
C  -3.045051 0.788887 0.375157
C  -1.802393 -1.231351 -0.342608
C  -4.283494 0.119832 -0.018026
C  6.489808 -3.319708 -0.286855
C  0.603584 0.913785 -0.006581
C  -3.082647 -1.780401 -0.768057
C  3.135777 1.52694 -1.177829
C  1.62706 1.58937 0.744607
C  -5.549475 0.803713 0.195987
C  -3.10474 2.127785 0.891182
C  2.862822 1.905566 0.172859
C  0.874038 0.570801 -1.356244
C  2.134035 0.837349 -1.922934
C  -0.636816 -2.07072 -0.420317
C  7.43311 -4.084377 0.667485
C  -3.118562 -3.094633 -1.352581
C  -5.544786 2.090098 0.742989
C  -4.3311 2.761932 1.075852
C  -0.712636 -3.350571 -0.963443
C  -1.961496 -3.85983 -1.45719
C  -6.925871 0.234608 -0.128034
C  2.205793 2.639157 2.891672
H  5.947204 -1.194084 -2.176314
H  4.662435 -1.193834 -0.878838
H  6.475951 -1.468555 0.881289
H  7.722458 -1.517391 -0.391622
H  6.68401 -3.633199 -1.331993
H  5.437319 -3.587367 -0.063882
H  -0.680996 1.249305 1.533676
H  4.48768 1.688191 -2.726288
H  -2.17927 2.669952 1.112846
H  3.641079 2.437472 0.724202
H  0.098389 0.091307 -1.958968
H  2.331741 0.54667 -2.961821
H  0.316056 -1.701391 -0.032277
H  7.240004 -3.809871 1.72092
H  7.296892 -5.176635 0.570578
H  8.491811 -3.853955 0.447829
H  -4.089192 -3.471245 -1.689714
H  -6.519512 2.568467 0.888878
H  -4.367986 3.785031 1.463798
H  0.182198 -3.980621 -1.006043
H  -2.002143 -4.862686 -1.895841
H  2.4435 3.627676 2.456577
H  3.133148 2.049424 3.008934
H  1.709929 2.76368 3.864902
H  -7.849669 -1.422928 -0.929465
H  -6.027364 -1.473587 -0.868694
