program: TURBOMOLE
programVersion: 7.3
elementType: v
basis: def2-TZVP
elementType: o
elementType: c
elementType: h
method: uhf
method: dft
functional: b3-lyp
elementType: v o c h
basis: def2-TZVP def2-TZVP def2-TZVP def2-TZVP
correction: disp3
energy: -1483.194886508 hartree
formula: C6H16O4V
InChI: InChI=1/C2H6O.2C2H5O.O.V/c3*1-2-3;;/h3H,2H2,1H3;2*2H2,1H3;;/q;2*-1;;+2/rC6H16O4V/c1-4-8-11(7,9-5-2)10-6-3/h8H,4-6H2,1-3H3
27 atoms
V  0.18658593 0.2578705 -0.33310707
O  0.14376015 0.66097684 1.19957903
O  1.64473725 -0.48357191 -1.04076449
O  -0.66676494 1.80995829 -1.38517565
O  -1.38579056 -0.52203889 -0.90560464
C  -0.82463098 3.14888956 -0.88265475
H  0.17200193 3.44964484 -0.55829908
H  -1.11754056 3.78418271 -1.72323212
C  -1.92509794 -1.70771273 -0.39142825
H  -2.5391981 -2.17432604 -1.17331834
H  -1.12415135 -2.42581345 -0.15622444
C  2.94816324 -0.88094665 -0.72852061
H  2.98814882 -1.97779352 -0.749325
H  3.61357727 -0.5236667 -1.5252075
H  -1.5276958 1.38906545 -1.55813968
C  -2.75944771 -1.44890243 0.84621657
H  -2.14713076 -0.97830411 1.61937806
H  -3.58873378 -0.77705639 0.61132026
H  -3.17126215 -2.38064016 1.24333721
C  3.41901235 -0.36808346 0.61489736
H  3.41782165 0.72464201 0.63197105
H  2.75838031 -0.71351292 1.41326035
H  4.43381275 -0.71635372 0.82379288
C  -1.81521879 3.21556093 0.2509371
H  -1.87887246 4.23957523 0.62516285
H  -2.81319039 2.91667095 -0.08097827
H  -1.50282931 2.55937079 1.06505138
nucrepener: 951.756064491 hartree
empdispcorrection: -0.025577584 hartree
energy: -1483.1948865083657
energyOcCorr: -1483.1949167753
s2: 0.75805301
charge: -0.000000
dipole: -14.345237 14.077684 -0.267553 67.656252 -66.559350 1.096902 -49.042106 48.381372 -0.660734
quadrupole: 1318.069945 -1370.723738 -52.653793 989.660113 -1037.203166 -47.543053 283.929162 -347.680733 -63.751570 -192.631738 188.559864 -4.071874 -25.995531 27.462784 1.467253 -96.380026 91.791309 -4.588718
