program: TURBOMOLE
programVersion: 7.3
elementType: cl
basis: def2-TZVP
elementType: v
elementType: o
elementType: c
elementType: h
method: uhf
method: dft
functional: b3-lyp
elementType: cl v o c h
basis: def2-TZVP def2-TZVP def2-TZVP def2-TZVP def2-TZVP
correction: disp3
energy: -7957.953809767 hartree
formula: C12H36ClO18V6
InChI: InChI=1/12CH3O.Cl.6O.6V/c12*1-2;;;;;;;;;;;;;/h12*1H3;;;;;;;;;;;;;/rC12H36O18V6.Cl/c1-19-31(13)20(2)32(19,14)23(5)34(16,24(32)6)27(9)36(18,28(34)10)29(11)35(17,30(36)12)25(7)33(15,21(31)3,22(31)4)26(35)8;/h1-12H3;
73 atoms
Cl -0.0000158 -0.0000463 0.0000176
V  2.60950397 -1.62353056 -0.0065932
V  -2.60922927 1.62335416 0.0066578
V  2.70509963 1.44706233 0.0030392
V  -2.70479123 -1.44718313 -0.0029404
V  0.09932026 3.07472009 -0.003188
V  -0.09907816 -3.07487569 0.0032098
O  3.94583354 -2.44747253 -0.0044508
O  4.08931489 2.18739294 -0.0004716
O  -4.08897159 -2.18757774 0.0007085
O  0.15122154 4.64377337 -0.0002603
O  -0.15094774 -4.64393317 0.000216
O  1.39755455 -2.62006227 -1.24162221
O  -1.39732105 2.61998217 1.24171561
O  2.83094538 -0.08975576 -1.23493341
O  -2.83076798 0.08966096 1.23504351
O  2.96177883 -0.09981336 1.23859611
O  -2.96160183 0.09966556 -1.23855561
O  1.56401188 2.5188223 -1.24012951
O  -1.56370528 -2.51898161 1.24018021
O  1.49236551 2.41131335 1.23311482
O  -1.49213161 -2.41148395 -1.23308011
O  -1.34229247 2.50270141 -1.23071581
O  1.34250287 -2.50274211 1.23074981
C  1.90767495 -3.58925659 -2.12086017
H  2.71626573 -3.16431375 -2.72536253
H  2.30421059 -4.44823455 -1.57045508
H  1.11781316 -3.94105135 -2.7926688
C  2.39099956 -0.03981399 -2.56529939
C  -2.39094636 0.03973288 2.56544789
H  3.00766471 0.66661783 -3.13066807
H  -3.00789211 -0.66643624 3.13084437
H  2.47914892 -1.0240695 -3.03016281
H  1.34727837 0.28192429 -2.61302087
H  -1.34733057 -0.28233949 2.61329587
C  4.0563853 -0.14194804 2.11772336
C  -4.056628 0.14172885 -2.11719476
H  4.99791683 -0.23439801 1.56730788
H  -4.09721698 -0.774502 -2.71595103
H  4.09615929 0.77381909 2.71724843
H  -3.96325814 0.99717791 -2.794324
H  3.96319464 -0.99798551 2.7941263
H  -4.99783203 0.23518591 -1.56639398
C  2.14958775 3.44103514 -2.12270886
C  -2.14940235 -3.44124884 2.12262816
H  2.83657978 2.92685844 -2.802971
H  -2.83682198 -2.92717995 2.80253729
H  1.37679356 3.93912715 -2.71799843
H  -1.37672166 -3.93906075 2.71830683
H  2.70942323 4.20611834 -1.57570098
H  -2.70879743 -4.20654914 1.57547528
C  1.22881752 2.05318009 2.56293839
C  -1.22877062 -2.05327109 -2.56291679
H  2.13024436 1.65304135 3.0322251
H  -2.13025426 -1.65307345 -3.03204911
H  -0.90870374 -2.93622004 -3.12569147
H  0.44017162 1.29753529 2.60839767
H  -0.44014422 -1.29761009 -2.60844167
C  -1.16655544 2.09844898 -2.56182249
C  1.16668224 -2.09852267 2.56185989
H  -0.90936264 1.03705329 -2.61032077
H  2.09159558 -2.26712031 3.12302927
H  -2.09164828 2.26661051 -3.12282507
H  0.36827506 -2.67785014 3.0306702
H  -0.36847866 2.67807794 -3.03083141
H  0.90990464 -1.03702799 2.61038387
O  -3.94557114 2.44728044 0.0044894
C  -1.90764015 3.58943078 2.12058577
H  -1.11809176 3.94083615 2.7929702
H  -2.71687903 3.16485265 2.72447053
H  -2.30334749 4.44859995 1.56988728
H  -2.47878102 1.0240757 3.0301895
H  0.90865574 2.93616274 3.12560597
empdispcorrection: -0.175258033 hartree
energy: -7957.9538097671530
energyOcCorr: -7957.9576003152
s2: 12.05543800
charge: -1.000000
dipole: 0.070709 -0.071018 -0.000309 -0.048030 0.047846 -0.000184 0.024068 -0.023851 0.000218
quadrupole: 7868.627991 -8142.892209 -274.264218 7887.447742 -8161.695221 -274.247480 2878.165916 -3070.355276 -192.189360 -8.236757 8.209178 -0.027578 -4.255082 4.275057 0.019975 1.548519 -1.591735 -0.043216
